{"text_format":"1","workbook":"xlsx","n_sheets":3,"sheets":["Item List","Transaction","Report"],"not_rendered":{"charts":0,"images":0,"macros":1,"external_links":0,"defined_names":0,"comments":0,"pivot_tables":0},"unopened":[],"bounds":{"document_bytes":16777216,"sheet_cells":100000,"rows_first":2000,"rows_last":500,"rows_between":2000,"halvings":0,"cell_chars":16384,"cell_head_chars":4096},"cells_cut":0,"cells_raw":0,"read":"whole","date_system":"1900"}

{"sheet":"Item List","index":0,"n_rows":24,"n_cols":4,"rows_kept":24,"cut":false,"hidden":false,"merged":[]}
["Item Code","Category","Description","Quanity"]
["196800460943","CA1","Lenovo intel i5-1235U 1.3G 512GB SSD 16GB RAM Windows 11 Pro",136]
["196379891780","CA2","Lenovo AMD Ryzen 5 5625U 2.3G 512GB SSD 16GB RAM Windows 11 Pro",94]
["195890378084","CA3","Lenovo intel i3-10110U 2.1GHz 128GB SSD 4GB RAM Windows 10 Pro",65]
["191999722094","CA5","Lenovo 15.6\" Laptop Casual Toploader T210 Grey-Row",88]
["195042086331","CA6","Lenovo 530 Wireless Mouse (Graphite) with battery",28]
["191545242878","CA7","Lenovo 510 Wireless Combo Keyboard & Mouse - NA",10]
["819927012030","CA8","Plugable USB 3.0 & USB-C Dual HDMI Display Docking Station",92]
["X002I8FY7H","CA9","Anker PowerExpand 8-in-1 USB-C PD Media Hub B2C - UN Gray Iteration 1",26]
["649241924616","CA10","Plugable USB 3.0 Dual Monitor Docking Station",135]
["97855089816","CA11","Logitech MK270 Full-size Wireless Keyboard Combo",10]
["731304436669","CA12","APC Home Network Battery Backup",67]
["X002BGBMG3","CA13","Wantek Corded Telephone Call Center Headset For Landline Phones",75]
["X002TUVAEZ","CA14","YOUMAKER Case for iPhone 12",128]
["X002MVT2X7","CA15","Saecosmo Transparent Shockproof iPhone 12 Case",99]
["194252027943","CA16","iPhone 12, Black, 64GB",99]
["194252515655","CA17","iPad (9th Generation) Wi-Fi 64GB",99]
["191927887857","CA18","Lenovo USB-C 65W AC Adapter (Original)",99]
["X0031MJNVR","CA19","65W USB-C Laptop Charger for Lenovo Laptops",99]
["X002XG9VRD","CA20","Anker PowerPort III 20W PD Cube with Charging Cable",99]
["X002IYQQWX","CA21","iPhone SE278 SP Build In Screen Protector Case",99]
["649528903617","CA22","Crucial 32GB Kit (2x16GB) DDR4 Memory",99]
["X002CAXF3V","CA23","SEYMAC Case for iPad 2021/220/2019",99]
["191999722124","CA24","Lenovo 15.6\" Laptop Casual Toploader T210 Blue-Row",99]

{"sheet":"Transaction","index":1,"n_rows":56,"n_cols":6,"rows_kept":56,"cut":false,"hidden":false,"merged":[]}
["Date And Time","Item Code","Category","Description","In/Out","Quanity"]
["12/14/202212:55:04 PM","196800460943","Lenovo","Lenovo intel i5-1235U 1.3G 512GB SSD 16GB RAM Windows 11 Pro","Out",1]
["12/14/202212:55:06 PM","196800460943","Lenovo","Lenovo intel i5-1235U 1.3G 512GB SSD 16GB RAM Windows 11 Pro","Out",1]
["12/14/202212:55:08 PM","196800460943","Lenovo","Lenovo intel i5-1235U 1.3G 512GB SSD 16GB RAM Windows 11 Pro","In",1]
["12/14/202212:55:10 PM","196800460943","Lenovo","Lenovo intel i5-1235U 1.3G 512GB SSD 16GB RAM Windows 11 Pro","In",1]
["12/14/202212:59:20 PM","196800460943","Lenovo","Lenovo intel i5-1235U 1.3G 512GB SSD 16GB RAM Windows 11 Pro","Out",1]
["12/14/202212:59:21 PM","196800460943","Lenovo","Lenovo intel i5-1235U 1.3G 512GB SSD 16GB RAM Windows 11 Pro","Out",1]
["12/14/20222:01:33 PM","196800460943","Lenovo","Lenovo intel i5-1235U 1.3G 512GB SSD 16GB RAM Windows 11 Pro","Out",1]
["12/14/20222:02:25 PM","196800460943","Lenovo","Lenovo intel i5-1235U 1.3G 512GB SSD 16GB RAM Windows 11 Pro","In",1]
["12/14/20222:02:52 PM","196800460943","Lenovo","Lenovo intel i5-1235U 1.3G 512GB SSD 16GB RAM Windows 11 Pro","In",1]
["12/14/20222:03:37 PM","196800460943","Lenovo","Lenovo intel i5-1235U 1.3G 512GB SSD 16GB RAM Windows 11 Pro","Out",1]
["12/14/20222:03:41 PM","196800460943","Lenovo","Lenovo intel i5-1235U 1.3G 512GB SSD 16GB RAM Windows 11 Pro","In",1]
["12/14/20222:03:43 PM","196800460943","Lenovo","Lenovo intel i5-1235U 1.3G 512GB SSD 16GB RAM Windows 11 Pro","Out",1]
["12/14/20222:05:29 PM","97855089816","CA11","Logitech MK270 Full-size Wireless Keyboard Combo","In",1]
["12/14/20222:05:40 PM","97855089816","CA11","Logitech MK270 Full-size Wireless Keyboard Combo","In",1]
["12/14/20222:05:42 PM","97855089816","CA11","Logitech MK270 Full-size Wireless Keyboard Combo","In",1]
["12/14/20222:05:42 PM","97855089816","CA11","Logitech MK270 Full-size Wireless Keyboard Combo","In",1]
["12/14/20222:05:43 PM","97855089816","CA11","Logitech MK270 Full-size Wireless Keyboard Combo","In",1]
["12/14/20222:05:43 PM","97855089816","CA11","Logitech MK270 Full-size Wireless Keyboard Combo","In",1]
["12/14/20222:05:44 PM","97855089816","CA11","Logitech MK270 Full-size Wireless Keyboard Combo","In",1]
["12/14/20222:05:44 PM","97855089816","CA11","Logitech MK270 Full-size Wireless Keyboard Combo","In",1]
["12/14/20222:05:44 PM","97855089816","CA11","Logitech MK270 Full-size Wireless Keyboard Combo","In",1]
["12/14/20222:05:45 PM","97855089816","CA11","Logitech MK270 Full-size Wireless Keyboard Combo","In",1]
["12/14/20222:05:45 PM","97855089816","CA11","Logitech MK270 Full-size Wireless Keyboard Combo","In",1]
["12/14/20222:05:46 PM","97855089816","CA11","Logitech MK270 Full-size Wireless Keyboard Combo","In",1]
["12/14/20222:05:46 PM","97855089816","CA11","Logitech MK270 Full-size Wireless Keyboard Combo","In",1]
["12/14/20222:08:48 PM","887276651668","CA4","Samsung SR35 24 inch Monitor","Out",1]
["12/14/20222:14:14 PM","196379891780","CA2","Lenovo AMD Ryzen 5 5625U 2.3G 512GB SSD 16GB RAM Windows 11 Pro","In",1]
["12/14/20222:14:15 PM","196379891780","CA2","Lenovo AMD Ryzen 5 5625U 2.3G 512GB SSD 16GB RAM Windows 11 Pro","In",1]
["12/14/20222:19:48 PM","A1","monitor","samsung","In",1]
["12/14/20222:22:44 PM","196800460943","CA1","Lenovo intel i5-1235U 1.3G 512GB SSD 16GB RAM Windows 11 Pro","In",1]
["12/14/20222:23:26 PM","X002TUVAEZ","CA14","YOUMAKER Case for iPhone 12","In",1]
["12/14/20222:24:06 PM","X002TUVAEZ","CA14","YOUMAKER Case for iPhone 12","In",1]
["12/14/20222:24:08 PM","X002TUVAEZ","CA14","YOUMAKER Case for iPhone 12","In",1]
["12/14/20222:24:09 PM","X002TUVAEZ","CA14","YOUMAKER Case for iPhone 12","In",1]
["12/14/20222:24:10 PM","X002TUVAEZ","CA14","YOUMAKER Case for iPhone 12","In",1]
["12/14/20222:24:11 PM","X002TUVAEZ","CA14","YOUMAKER Case for iPhone 12","In",1]
["12/14/20222:24:12 PM","X002TUVAEZ","CA14","YOUMAKER Case for iPhone 12","In",1]
["12/14/20222:24:17 PM","X002TUVAEZ","CA14","YOUMAKER Case for iPhone 12","In",1]
["12/14/20222:24:30 PM","X002TUVAEZ","CA14","YOUMAKER Case for iPhone 12","In",1]
{"$rows_left_out":17}
{"sheet":"Report","index":2,"n_rows":172,"n_cols":11,"rows_kept":172,"cut":false,"hidden":false,"merged":[]}
["Product","Opening Stock","In","Out","Closing Stock"]
[{"$f":"IF('Item List'!A2=\"\",\"\",'Item List'!A2)","v":"196800460943"},{"$f":"IF(A2=\"\",\"\",SUMIF('Item List'!A:D,Report!A2,'Item List'!D:D))","v":136},{"$f":"IF(A2=\"\",\"\",SUMIFS(Transaction!F:F,Transaction!E:E,\"In\",Transaction!B:B,Report!A2))","v":6},{"$f":"IF(A2=\"\",\"\",SUMIFS(Transaction!F:F,Transaction!E:E,\"out\",Transaction!B:B,Report!A2))","v":7},{"$f":"IF(A2=\"\",\"\",B2+C2-D2)","v":135}]
[{"$f":"IF('Item List'!A3=\"\",\"\",'Item List'!A3)","v":"196379891780"},{"$f":"IF(A3=\"\",\"\",SUMIF('Item List'!A:D,Report!A3,'Item List'!D:D))","v":94},{"$f":"IF(A3=\"\",\"\",SUMIFS(Transaction!F:F,Transaction!E:E,\"In\",Transaction!B:B,Report!A3))","v":2},{"$f":"IF(A3=\"\",\"\",SUMIFS(Transaction!F:F,Transaction!E:E,\"out\",Transaction!B:B,Report!A3))","v":0},{"$f":"IF(A3=\"\",\"\",B3+C3-D3)","v":96}]
[{"$f":"IF('Item List'!A4=\"\",\"\",'Item List'!A4)","v":"195890378084"},{"$f":"IF(A4=\"\",\"\",SUMIF('Item List'!A:D,Report!A4,'Item List'!D:D))","v":65},{"$f":"IF(A4=\"\",\"\",SUMIFS(Transaction!F:F,Transaction!E:E,\"In\",Transaction!B:B,Report!A4))","v":0},{"$f":"IF(A4=\"\",\"\",SUMIFS(Transaction!F:F,Transaction!E:E,\"out\",Transaction!B:B,Report!A4))","v":0},65]
[{"$f":"IF('Item List'!A5=\"\",\"\",'Item List'!A5)","v":"191999722094"},{"$f":"IF(A5=\"\",\"\",SUMIF('Item List'!A:D,Report!A5,'Item List'!D:D))","v":88},{"$f":"IF(A5=\"\",\"\",SUMIFS(Transaction!F:F,Transaction!E:E,\"In\",Transaction!B:B,Report!A5))","v":0},{"$f":"IF(A5=\"\",\"\",SUMIFS(Transaction!F:F,Transaction!E:E,\"out\",Transaction!B:B,Report!A5))","v":0},88]
[{"$f":"IF('Item List'!A6=\"\",\"\",'Item List'!A6)","v":"195042086331"},{"$f":"IF(A6=\"\",\"\",SUMIF('Item List'!A:D,Report!A6,'Item List'!D:D))","v":28},{"$f":"IF(A6=\"\",\"\",SUMIFS(Transaction!F:F,Transaction!E:E,\"In\",Transaction!B:B,Report!A6))","v":0},{"$f":"IF(A6=\"\",\"\",SUMIFS(Transaction!F:F,Transaction!E:E,\"out\",Transaction!B:B,Report!A6))","v":0},28]
[{"$f":"IF('Item List'!A7=\"\",\"\",'Item List'!A7)","v":"191545242878"},{"$f":"IF(A7=\"\",\"\",SUMIF('Item List'!A:D,Report!A7,'Item List'!D:D))","v":10},{"$f":"IF(A7=\"\",\"\",SUMIFS(Transaction!F:F,Transaction!E:E,\"In\",Transaction!B:B,Report!A7))","v":0},{"$f":"IF(A7=\"\",\"\",SUMIFS(Transaction!F:F,Transaction!E:E,\"out\",Transaction!B:B,Report!A7))","v":0},10]
[{"$f":"IF('Item List'!A8=\"\",\"\",'Item List'!A8)","v":"819927012030"},{"$f":"IF(A8=\"\",\"\",SUMIF('Item List'!A:D,Report!A8,'Item List'!D:D))","v":92},{"$f":"IF(A8=\"\",\"\",SUMIFS(Transaction!F:F,Transaction!E:E,\"In\",Transaction!B:B,Report!A8))","v":0},{"$f":"IF(A8=\"\",\"\",SUMIFS(Transaction!F:F,Transaction!E:E,\"out\",Transaction!B:B,Report!A8))","v":0},92]
[{"$f":"IF('Item List'!A9=\"\",\"\",'Item List'!A9)","v":"X002I8FY7H"},{"$f":"IF(A9=\"\",\"\",SUMIF('Item List'!A:D,Report!A9,'Item List'!D:D))","v":26},{"$f":"IF(A9=\"\",\"\",SUMIFS(Transaction!F:F,Transaction!E:E,\"In\",Transaction!B:B,Report!A9))","v":0},{"$f":"IF(A9=\"\",\"\",SUMIFS(Transaction!F:F,Transaction!E:E,\"out\",Transaction!B:B,Report!A9))","v":0},26]
[{"$f":"IF('Item List'!A10=\"\",\"\",'Item List'!A10)","v":"649241924616"},{"$f":"IF(A10=\"\",\"\",SUMIF('Item List'!A:D,Report!A10,'Item List'!D:D))","v":135},{"$f":"IF(A10=\"\",\"\",SUMIFS(Transaction!F:F,Transaction!E:E,\"In\",Transaction!B:B,Report!A10))","v":0},{"$f":"IF(A10=\"\",\"\",SUMIFS(Transaction!F:F,Transaction!E:E,\"out\",Transaction!B:B,Report!A10))","v":0},135,null,null,null,null,null,"X002TUVAEZ"]
[{"$f":"IF('Item List'!A11=\"\",\"\",'Item List'!A11)","v":"97855089816"},{"$f":"IF(A11=\"\",\"\",SUMIF('Item List'!A:D,Report!A11,'Item List'!D:D))","v":10},{"$f":"IF(A11=\"\",\"\",SUMIFS(Transaction!F:F,Transaction!E:E,\"In\",Transaction!B:B,Report!A11))","v":13},{"$f":"IF(A11=\"\",\"\",SUMIFS(Transaction!F:F,Transaction!E:E,\"out\",Transaction!B:B,Report!A11))","v":0},23]
[{"$f":"IF('Item List'!A12=\"\",\"\",'Item List'!A12)","v":"731304436669"},{"$f":"IF(A12=\"\",\"\",SUMIF('Item List'!A:D,Report!A12,'Item List'!D:D))","v":67},{"$f":"IF(A12=\"\",\"\",SUMIFS(Transaction!F:F,Transaction!E:E,\"In\",Transaction!B:B,Report!A12))","v":0},{"$f":"IF(A12=\"\",\"\",SUMIFS(Transaction!F:F,Transaction!E:E,\"out\",Transaction!B:B,Report!A12))","v":0},67,null,null,null,null,null,"97855089816"]
[{"$f":"IF('Item List'!A13=\"\",\"\",'Item List'!A13)","v":"X002BGBMG3"},{"$f":"IF(A13=\"\",\"\",SUMIF('Item List'!A:D,Report!A13,'Item List'!D:D))","v":75},{"$f":"IF(A13=\"\",\"\",SUMIFS(Transaction!F:F,Transaction!E:E,\"In\",Transaction!B:B,Report!A13))","v":0},{"$f":"IF(A13=\"\",\"\",SUMIFS(Transaction!F:F,Transaction!E:E,\"out\",Transaction!B:B,Report!A13))","v":0},75]
[{"$f":"IF('Item List'!A14=\"\",\"\",'Item List'!A14)","v":"X002TUVAEZ"},{"$f":"IF(A14=\"\",\"\",SUMIF('Item List'!A:D,Report!A14,'Item List'!D:D))","v":128},{"$f":"IF(A14=\"\",\"\",SUMIFS(Transaction!F:F,Transaction!E:E,\"In\",Transaction!B:B,Report!A14))","v":14},{"$f":"IF(A14=\"\",\"\",SUMIFS(Transaction!F:F,Transaction!E:E,\"out\",Transaction!B:B,Report!A14))","v":11},131]
[{"$f":"IF('Item List'!A15=\"\",\"\",'Item List'!A15)","v":"X002MVT2X7"},{"$f":"IF(A15=\"\",\"\",SUMIF('Item List'!A:D,Report!A15,'Item List'!D:D))","v":99},{"$f":"IF(A15=\"\",\"\",SUMIFS(Transaction!F:F,Transaction!E:E,\"In\",Transaction!B:B,Report!A15))","v":0},{"$f":"IF(A15=\"\",\"\",SUMIFS(Transaction!F:F,Transaction!E:E,\"out\",Transaction!B:B,Report!A15))","v":0},99]
[{"$f":"IF('Item List'!A16=\"\",\"\",'Item List'!A16)","v":"194252027943"},{"$f":"IF(A16=\"\",\"\",SUMIF('Item List'!A:D,Report!A16,'Item List'!D:D))","v":99},{"$f":"IF(A16=\"\",\"\",SUMIFS(Transaction!F:F,Transaction!E:E,\"In\",Transaction!B:B,Report!A16))","v":0},{"$f":"IF(A16=\"\",\"\",SUMIFS(Transaction!F:F,Transaction!E:E,\"out\",Transaction!B:B,Report!A16))","v":0},99]
[{"$f":"IF('Item List'!A17=\"\",\"\",'Item List'!A17)","v":"194252515655"},{"$f":"IF(A17=\"\",\"\",SUMIF('Item List'!A:D,Report!A17,'Item List'!D:D))","v":99},{"$f":"IF(A17=\"\",\"\",SUMIFS(Transaction!F:F,Transaction!E:E,\"In\",Transaction!B:B,Report!A17))","v":0},{"$f":"IF(A17=\"\",\"\",SUMIFS(Transaction!F:F,Transaction!E:E,\"out\",Transaction!B:B,Report!A17))","v":0},99]
[{"$f":"IF('Item List'!A18=\"\",\"\",'Item List'!A18)","v":"191927887857"},{"$f":"IF(A18=\"\",\"\",SUMIF('Item List'!A:D,Report!A18,'Item List'!D:D))","v":99},{"$f":"IF(A18=\"\",\"\",SUMIFS(Transaction!F:F,Transaction!E:E,\"In\",Transaction!B:B,Report!A18))","v":0},{"$f":"IF(A18=\"\",\"\",SUMIFS(Transaction!F:F,Transaction!E:E,\"out\",Transaction!B:B,Report!A18))","v":0},99]
[{"$f":"IF('Item List'!A19=\"\",\"\",'Item List'!A19)","v":"X0031MJNVR"},{"$f":"IF(A19=\"\",\"\",SUMIF('Item List'!A:D,Report!A19,'Item List'!D:D))","v":99},{"$f":"IF(A19=\"\",\"\",SUMIFS(Transaction!F:F,Transaction!E:E,\"In\",Transaction!B:B,Report!A19))","v":0},{"$f":"IF(A19=\"\",\"\",SUMIFS(Transaction!F:F,Transaction!E:E,\"out\",Transaction!B:B,Report!A19))","v":0},99]
[{"$f":"IF('Item List'!A20=\"\",\"\",'Item List'!A20)","v":"X002XG9VRD"},{"$f":"IF(A20=\"\",\"\",SUMIF('Item List'!A:D,Report!A20,'Item List'!D:D))","v":99},{"$f":"IF(A20=\"\",\"\",SUMIFS(Transaction!F:F,Transaction!E:E,\"In\",Transaction!B:B,Report!A20))","v":0},{"$f":"IF(A20=\"\",\"\",SUMIFS(Transaction!F:F,Transaction!E:E,\"out\",Transaction!B:B,Report!A20))","v":0},99]
[{"$f":"IF('Item List'!A21=\"\",\"\",'Item List'!A21)","v":"X002IYQQWX"},{"$f":"IF(A21=\"\",\"\",SUMIF('Item List'!A:D,Report!A21,'Item List'!D:D))","v":99},{"$f":"IF(A21=\"\",\"\",SUMIFS(Transaction!F:F,Transaction!E:E,\"In\",Transaction!B:B,Report!A21))","v":0},{"$f":"IF(A21=\"\",\"\",SUMIFS(Transaction!F:F,Transaction!E:E,\"out\",Transaction!B:B,Report!A21))","v":0},99]
[{"$f":"IF('Item List'!A22=\"\",\"\",'Item List'!A22)","v":"649528903617"},{"$f":"IF(A22=\"\",\"\",SUMIF('Item List'!A:D,Report!A22,'Item List'!D:D))","v":99},{"$f":"IF(A22=\"\",\"\",SUMIFS(Transaction!F:F,Transaction!E:E,\"In\",Transaction!B:B,Report!A22))","v":0},{"$f":"IF(A22=\"\",\"\",SUMIFS(Transaction!F:F,Transaction!E:E,\"out\",Transaction!B:B,Report!A22))","v":0},99]
[{"$f":"IF('Item List'!A23=\"\",\"\",'Item List'!A23)","v":"X002CAXF3V"},{"$f":"IF(A23=\"\",\"\",SUMIF('Item List'!A:D,Report!A23,'Item List'!D:D))","v":99},{"$f":"IF(A23=\"\",\"\",SUMIFS(Transaction!F:F,Transaction!E:E,\"In\",Transaction!B:B,Report!A23))","v":0},{"$f":"IF(A23=\"\",\"\",SUMIFS(Transaction!F:F,Transaction!E:E,\"out\",Transaction!B:B,Report!A23))","v":0},99]
[{"$f":"IF('Item List'!A24=\"\",\"\",'Item List'!A24)","v":"191999722124"},{"$f":"IF(A24=\"\",\"\",SUMIF('Item List'!A:D,Report!A24,'Item List'!D:D))","v":99},{"$f":"IF(A24=\"\",\"\",SUMIFS(Transaction!F:F,Transaction!E:E,\"In\",Transaction!B:B,Report!A24))","v":0},{"$f":"IF(A24=\"\",\"\",SUMIFS(Transaction!F:F,Transaction!E:E,\"out\",Transaction!B:B,Report!A24))","v":0},99]
[{"$f":"IF('Item List'!A25=\"\",\"\",'Item List'!A25)","v":""},{"$f":"IF(A25=\"\",\"\",SUMIF('Item List'!A:D,Report!A25,'Item List'!D:D))","v":""},{"$f":"IF(A25=\"\",\"\",SUMIFS(Transaction!F:F,Transaction!E:E,\"In\",Transaction!B:B,Report!A25))","v":""},{"$f":"IF(A25=\"\",\"\",SUMIFS(Transaction!F:F,Transaction!E:E,\"out\",Transaction!B:B,Report!A25))","v":""},""]
[{"$f":"IF('Item List'!A26=\"\",\"\",'Item List'!A26)","v":""},{"$f":"IF(A26=\"\",\"\",SUMIF('Item List'!A:D,Report!A26,'Item List'!D:D))","v":""},{"$f":"IF(A26=\"\",\"\",SUMIFS(Transaction!F:F,Transaction!E:E,\"In\",Transaction!B:B,Report!A26))","v":""},{"$f":"IF(A26=\"\",\"\",SUMIFS(Transaction!F:F,Transaction!E:E,\"out\",Transaction!B:B,Report!A26))","v":""},""]
[{"$f":"IF('Item List'!A27=\"\",\"\",'Item List'!A27)","v":""},{"$f":"IF(A27=\"\",\"\",SUMIF('Item List'!A:D,Report!A27,'Item List'!D:D))","v":""},{"$f":"IF(A27=\"\",\"\",SUMIFS(Transaction!F:F,Transaction!E:E,\"In\",Transaction!B:B,Report!A27))","v":""},{"$f":"IF(A27=\"\",\"\",SUMIFS(Transaction!F:F,Transaction!E:E,\"out\",Transaction!B:B,Report!A27))","v":""},""]
[{"$f":"IF('Item List'!A28=\"\",\"\",'Item List'!A28)","v":""},{"$f":"IF(A28=\"\",\"\",SUMIF('Item List'!A:D,Report!A28,'Item List'!D:D))","v":""},{"$f":"IF(A28=\"\",\"\",SUMIFS(Transaction!F:F,Transaction!E:E,\"In\",Transaction!B:B,Report!A28))","v":""},{"$f":"IF(A28=\"\",\"\",SUMIFS(Transaction!F:F,Transaction!E:E,\"out\",Transaction!B:B,Report!A28))","v":""},""]
[{"$f":"IF('Item List'!A29=\"\",\"\",'Item List'!A29)","v":""},{"$f":"IF(A29=\"\",\"\",SUMIF('Item List'!A:D,Report!A29,'Item List'!D:D))","v":""},{"$f":"IF(A29=\"\",\"\",SUMIFS(Transaction!F:F,Transaction!E:E,\"In\",Transaction!B:B,Report!A29))","v":""},{"$f":"IF(A29=\"\",\"\",SUMIFS(Transaction!F:F,Transaction!E:E,\"out\",Transaction!B:B,Report!A29))","v":""},""]
[{"$f":"IF('Item List'!A30=\"\",\"\",'Item List'!A30)","v":""},{"$f":"IF(A30=\"\",\"\",SUMIF('Item List'!A:D,Report!A30,'Item List'!D:D))","v":""},{"$f":"IF(A30=\"\",\"\",SUMIFS(Transaction!F:F,Transaction!E:E,\"In\",Transaction!B:B,Report!A30))","v":""},{"$f":"IF(A30=\"\",\"\",SUMIFS(Transaction!F:F,Transaction!E:E,\"out\",Transaction!B:B,Report!A30))","v":""},""]
[{"$f":"IF('Item List'!A31=\"\",\"\",'Item List'!A31)","v":""},{"$f":"IF(A31=\"\",\"\",SUMIF('Item List'!A:D,Report!A31,'Item List'!D:D))","v":""},{"$f":"IF(A31=\"\",\"\",SUMIFS(Transaction!F:F,Transaction!E:E,\"In\",Transaction!B:B,Report!A31))","v":""},{"$f":"IF(A31=\"\",\"\",SUMIFS(Transaction!F:F,Transaction!E:E,\"out\",Transaction!B:B,Report!A31))","v":""},""]
[{"$f":"IF('Item List'!A32=\"\",\"\",'Item List'!A32)","v":""},{"$f":"IF(A32=\"\",\"\",SUMIF('Item List'!A:D,Report!A32,'Item List'!D:D))","v":""},{"$f":"IF(A32=\"\",\"\",SUMIFS(Transaction!F:F,Transaction!E:E,\"In\",Transaction!B:B,Report!A32))","v":""},{"$f":"IF(A32=\"\",\"\",SUMIFS(Transaction!F:F,Transaction!E:E,\"out\",Transaction!B:B,Report!A32))","v":""},""]
[{"$f":"IF('Item List'!A33=\"\",\"\",'Item List'!A33)","v":""},{"$f":"IF(A33=\"\",\"\",SUMIF('Item List'!A:D,Report!A33,'Item List'!D:D))","v":""},{"$f":"IF(A33=\"\",\"\",SUMIFS(Transaction!F:F,Transaction!E:E,\"In\",Transaction!B:B,Report!A33))","v":""},{"$f":"IF(A33=\"\",\"\",SUMIFS(Transaction!F:F,Transaction!E:E,\"out\",Transaction!B:B,Report!A33))","v":""},""]
[{"$f":"IF('Item List'!A34=\"\",\"\",'Item List'!A34)","v":""},{"$f":"IF(A34=\"\",\"\",SUMIF('Item List'!A:D,Report!A34,'Item List'!D:D))","v":""},{"$f":"IF(A34=\"\",\"\",SUMIFS(Transaction!F:F,Transaction!E:E,\"In\",Transaction!B:B,Report!A34))","v":""},{"$f":"IF(A34=\"\",\"\",SUMIFS(Transaction!F:F,Transaction!E:E,\"out\",Transaction!B:B,Report!A34))","v":""},""]
[{"$f":"IF('Item List'!A35=\"\",\"\",'Item List'!A35)","v":""},{"$f":"IF(A35=\"\",\"\",SUMIF('Item List'!A:D,Report!A35,'Item List'!D:D))","v":""},{"$f":"IF(A35=\"\",\"\",SUMIFS(Transaction!F:F,Transaction!E:E,\"In\",Transaction!B:B,Report!A35))","v":""},{"$f":"IF(A35=\"\",\"\",SUMIFS(Transaction!F:F,Transaction!E:E,\"out\",Transaction!B:B,Report!A35))","v":""},""]
[{"$f":"IF('Item List'!A36=\"\",\"\",'Item List'!A36)","v":""},{"$f":"IF(A36=\"\",\"\",SUMIF('Item List'!A:D,Report!A36,'Item List'!D:D))","v":""},{"$f":"IF(A36=\"\",\"\",SUMIFS(Transaction!F:F,Transaction!E:E,\"In\",Transaction!B:B,Report!A36))","v":""},{"$f":"IF(A36=\"\",\"\",SUMIFS(Transaction!F:F,Transaction!E:E,\"out\",Transaction!B:B,Report!A36))","v":""},""]
[{"$f":"IF('Item List'!A37=\"\",\"\",'Item List'!A37)","v":""},{"$f":"IF(A37=\"\",\"\",SUMIF('Item List'!A:D,Report!A37,'Item List'!D:D))","v":""},{"$f":"IF(A37=\"\",\"\",SUMIFS(Transaction!F:F,Transaction!E:E,\"In\",Transaction!B:B,Report!A37))","v":""},{"$f":"IF(A37=\"\",\"\",SUMIFS(Transaction!F:F,Transaction!E:E,\"out\",Transaction!B:B,Report!A37))","v":""},""]
[{"$f":"IF('Item List'!A38=\"\",\"\",'Item List'!A38)","v":""},{"$f":"IF(A38=\"\",\"\",SUMIF('Item List'!A:D,Report!A38,'Item List'!D:D))","v":""},{"$f":"IF(A38=\"\",\"\",SUMIFS(Transaction!F:F,Transaction!E:E,\"In\",Transaction!B:B,Report!A38))","v":""},{"$f":"IF(A38=\"\",\"\",SUMIFS(Transaction!F:F,Transaction!E:E,\"out\",Transaction!B:B,Report!A38))","v":""},""]
[{"$f":"IF('Item List'!A39=\"\",\"\",'Item List'!A39)","v":""},{"$f":"IF(A39=\"\",\"\",SUMIF('Item List'!A:D,Report!A39,'Item List'!D:D))","v":""},{"$f":"IF(A39=\"\",\"\",SUMIFS(Transaction!F:F,Transaction!E:E,\"In\",Transaction!B:B,Report!A39))","v":""},{"$f":"IF(A39=\"\",\"\",SUMIFS(Transaction!F:F,Transaction!E:E,\"out\",Transaction!B:B,Report!A39))","v":""},""]
[{"$f":"IF('Item List'!A40=\"\",\"\",'Item List'!A40)","v":""},{"$f":"IF(A40=\"\",\"\",SUMIF('Item List'!A:D,Report!A40,'Item List'!D:D))","v":""},{"$f":"IF(A40=\"\",\"\",SUMIFS(Transaction!F:F,Transaction!E:E,\"In\",Transaction!B:B,Report!A40))","v":""},{"$f":"IF(A40=\"\",\"\",SUMIFS(Transaction!F:F,Transaction!E:E,\"out\",Transaction!B:B,Report!A40))","v":""},""]
{"$rows_left_out":132}