{"text_format":"1","workbook":"xlsx","n_sheets":3,"sheets":["Item List","Transaction","Report"],"not_rendered":{"charts":0,"images":0,"macros":1,"external_links":0,"defined_names":0,"comments":0,"pivot_tables":0},"unopened":[],"bounds":{"document_bytes":16777216,"sheet_cells":100000,"rows_first":2000,"rows_last":500,"rows_between":2000,"halvings":0,"cell_chars":16384,"cell_head_chars":4096},"cells_cut":0,"cells_raw":0,"read":"whole","date_system":"1900"}

{"sheet":"Item List","index":0,"n_rows":24,"n_cols":4,"rows_kept":24,"cut":false,"hidden":false,"merged":[]}
["Item Code","Category","Description","Quanity"]
["196800460943","CA1","Lenovo intel i5-1235U 1.3G 512GB SSD 16GB RAM Windows 11 Pro",136]
["196379891780","CA2","Lenovo AMD Ryzen 5 5625U 2.3G 512GB SSD 16GB RAM Windows 11 Pro",94]
["195890378084","CA3","Lenovo intel i3-10110U 2.1GHz 128GB SSD 4GB RAM Windows 10 Pro",65]
["191999722094","CA5","Lenovo 15.6\" Laptop Casual Toploader T210 Grey-Row",88]
["195042086331","CA6","Lenovo 530 Wireless Mouse (Graphite) with battery",28]
["191545242878","CA7","Lenovo 510 Wireless Combo Keyboard & Mouse - NA",10]
["819927012030","CA8","Plugable USB 3.0 & USB-C Dual HDMI Display Docking Station",92]
["X002I8FY7H","CA9","Anker PowerExpand 8-in-1 USB-C PD Media Hub B2C - UN Gray Iteration 1",26]
["649241924616","CA10","Plugable USB 3.0 Dual Monitor Docking Station",135]
["97855089816","CA11","Logitech MK270 Full-size Wireless Keyboard Combo",10]
["731304436669","CA12","APC Home Network Battery Backup",67]
["X002BGBMG3","CA13","Wantek Corded Telephone Call Center Headset For Landline Phones",75]
["X002TUVAEZ","CA14","YOUMAKER Case for iPhone 12",128]
["X002MVT2X7","CA15","Saecosmo Transparent Shockproof iPhone 12 Case",99]
["194252027943","CA16","iPhone 12, Black, 64GB",99]
["194252515655","CA17","iPad (9th Generation) Wi-Fi 64GB",99]
["191927887857","CA18","Lenovo USB-C 65W AC Adapter (Original)",99]
["X0031MJNVR","CA19","65W USB-C Laptop Charger for Lenovo Laptops",99]
["X002XG9VRD","CA20","Anker PowerPort III 20W PD Cube with Charging Cable",99]
["X002IYQQWX","CA21","iPhone SE278 SP Build In Screen Protector Case",99]
["649528903617","CA22","Crucial 32GB Kit (2x16GB) DDR4 Memory",99]
["X002CAXF3V","CA23","SEYMAC Case for iPad 2021/220/2019",99]
["191999722124","CA24","Lenovo 15.6\" Laptop Casual Toploader T210 Blue-Row",99]

{"sheet":"Transaction","index":1,"n_rows":56,"n_cols":6,"rows_kept":56,"cut":false,"hidden":false,"merged":[]}
["Date And Time","Item Code","Category","Description","In/Out","Quanity"]
["12/14/202212:55:04 PM","196800460943","Lenovo","Lenovo intel i5-1235U 1.3G 512GB SSD 16GB RAM Windows 11 Pro","Out",1]
["12/14/202212:55:06 PM","196800460943","Lenovo","Lenovo intel i5-1235U 1.3G 512GB SSD 16GB RAM Windows 11 Pro","Out",1]
["12/14/202212:55:08 PM","196800460943","Lenovo","Lenovo intel i5-1235U 1.3G 512GB SSD 16GB RAM Windows 11 Pro","In",1]
["12/14/202212:55:10 PM","196800460943","Lenovo","Lenovo intel i5-1235U 1.3G 512GB SSD 16GB RAM Windows 11 Pro","In",1]
["12/14/202212:59:20 PM","196800460943","Lenovo","Lenovo intel i5-1235U 1.3G 512GB SSD 16GB RAM Windows 11 Pro","Out",1]
["12/14/202212:59:21 PM","196800460943","Lenovo","Lenovo intel i5-1235U 1.3G 512GB SSD 16GB RAM Windows 11 Pro","Out",1]
["12/14/20222:01:33 PM","196800460943","Lenovo","Lenovo intel i5-1235U 1.3G 512GB SSD 16GB RAM Windows 11 Pro","Out",1]
["12/14/20222:02:25 PM","196800460943","Lenovo","Lenovo intel i5-1235U 1.3G 512GB SSD 16GB RAM Windows 11 Pro","In",1]
["12/14/20222:02:52 PM","196800460943","Lenovo","Lenovo intel i5-1235U 1.3G 512GB SSD 16GB RAM Windows 11 Pro","In",1]
["12/14/20222:03:37 PM","196800460943","Lenovo","Lenovo intel i5-1235U 1.3G 512GB SSD 16GB RAM Windows 11 Pro","Out",1]
["12/14/20222:03:41 PM","196800460943","Lenovo","Lenovo intel i5-1235U 1.3G 512GB SSD 16GB RAM Windows 11 Pro","In",1]
["12/14/20222:03:43 PM","196800460943","Lenovo","Lenovo intel i5-1235U 1.3G 512GB SSD 16GB RAM Windows 11 Pro","Out",1]
["12/14/20222:05:29 PM","97855089816","CA11","Logitech MK270 Full-size Wireless Keyboard Combo","In",1]
["12/14/20222:05:40 PM","97855089816","CA11","Logitech MK270 Full-size Wireless Keyboard Combo","In",1]
["12/14/20222:05:42 PM","97855089816","CA11","Logitech MK270 Full-size Wireless Keyboard Combo","In",1]
["12/14/20222:05:42 PM","97855089816","CA11","Logitech MK270 Full-size Wireless Keyboard Combo","In",1]
["12/14/20222:05:43 PM","97855089816","CA11","Logitech MK270 Full-size Wireless Keyboard Combo","In",1]
["12/14/20222:05:43 PM","97855089816","CA11","Logitech MK270 Full-size Wireless Keyboard Combo","In",1]
["12/14/20222:05:44 PM","97855089816","CA11","Logitech MK270 Full-size Wireless Keyboard Combo","In",1]
["12/14/20222:05:44 PM","97855089816","CA11","Logitech MK270 Full-size Wireless Keyboard Combo","In",1]
["12/14/20222:05:44 PM","97855089816","CA11","Logitech MK270 Full-size Wireless Keyboard Combo","In",1]
["12/14/20222:05:45 PM","97855089816","CA11","Logitech MK270 Full-size Wireless Keyboard Combo","In",1]
["12/14/20222:05:45 PM","97855089816","CA11","Logitech MK270 Full-size Wireless Keyboard Combo","In",1]
["12/14/20222:05:46 PM","97855089816","CA11","Logitech MK270 Full-size Wireless Keyboard Combo","In",1]
["12/14/20222:05:46 PM","97855089816","CA11","Logitech MK270 Full-size Wireless Keyboard Combo","In",1]
["12/14/20222:08:48 PM","887276651668","CA4","Samsung SR35 24 inch Monitor","Out",1]
["12/14/20222:14:14 PM","196379891780","CA2","Lenovo AMD Ryzen 5 5625U 2.3G 512GB SSD 16GB RAM Windows 11 Pro","In",1]
["12/14/20222:14:15 PM","196379891780","CA2","Lenovo AMD Ryzen 5 5625U 2.3G 512GB SSD 16GB RAM Windows 11 Pro","In",1]
["12/14/20222:19:48 PM","A1","monitor","samsung","In",1]
["12/14/20222:22:44 PM","196800460943","CA1","Lenovo intel i5-1235U 1.3G 512GB SSD 16GB RAM Windows 11 Pro","In",1]
["12/14/20222:23:26 PM","X002TUVAEZ","CA14","YOUMAKER Case for iPhone 12","In",1]
["12/14/20222:24:06 PM","X002TUVAEZ","CA14","YOUMAKER Case for iPhone 12","In",1]
["12/14/20222:24:08 PM","X002TUVAEZ","CA14","YOUMAKER Case for iPhone 12","In",1]
["12/14/20222:24:09 PM","X002TUVAEZ","CA14","YOUMAKER Case for iPhone 12","In",1]
["12/14/20222:24:10 PM","X002TUVAEZ","CA14","YOUMAKER Case for iPhone 12","In",1]
["12/14/20222:24:11 PM","X002TUVAEZ","CA14","YOUMAKER Case for iPhone 12","In",1]
["12/14/20222:24:12 PM","X002TUVAEZ","CA14","YOUMAKER Case for iPhone 12","In",1]
["12/14/20222:24:17 PM","X002TUVAEZ","CA14","YOUMAKER Case for iPhone 12","In",1]
["12/14/20222:24:30 PM","X002TUVAEZ","CA14","YOUMAKER Case for iPhone 12","In",1]
["12/14/20222:25:18 PM","X002TUVAEZ","CA14","YOUMAKER Case for iPhone 12","In",1]
["12/14/20222:25:39 PM","X002TUVAEZ","CA14","YOUMAKER Case for iPhone 12","Out",1]
["12/14/20222:26:49 PM","X002TUVAEZ","CA14","YOUMAKER Case for iPhone 12","In",1]
["12/14/20222:26:51 PM","X002TUVAEZ","CA14","YOUMAKER Case for iPhone 12","In",1]
["12/14/20222:26:53 PM","X002TUVAEZ","CA14","YOUMAKER Case for iPhone 12","In",1]
["12/14/20222:26:54 PM","X002TUVAEZ","CA14","YOUMAKER Case for iPhone 12","In",1]
["12/14/20222:26:56 PM","X002TUVAEZ","CA14","YOUMAKER Case for iPhone 12","Out",1]
["12/14/20222:26:57 PM","X002TUVAEZ","CA14","YOUMAKER Case for iPhone 12","Out",1]
["12/14/20222:26:58 PM","X002TUVAEZ","CA14","YOUMAKER Case for iPhone 12","Out",1]
["12/14/20222:26:59 PM","X002TUVAEZ","CA14","YOUMAKER Case for iPhone 12","Out",1]
["12/14/20222:27:00 PM","X002TUVAEZ","CA14","YOUMAKER Case for iPhone 12","Out",1]
["12/14/20222:27:01 PM","X002TUVAEZ","CA14","YOUMAKER Case for iPhone 12","Out",1]
["12/14/20222:27:37 PM","X002TUVAEZ","CA14","YOUMAKER Case for iPhone 12","Out",1]
["12/14/20222:27:38 PM","X002TUVAEZ","CA14","YOUMAKER Case for iPhone 12","Out",1]
["12/14/20222:30:28 PM","X002TUVAEZ","CA14","YOUMAKER Case for iPhone 12","Out",1]
["12/14/20222:30:31 PM","X002TUVAEZ","CA14","YOUMAKER Case for iPhone 12","Out",1]

{"sheet":"Report","index":2,"n_rows":172,"n_cols":11,"rows_kept":172,"cut":false,"hidden":false,"merged":[]}
["Product","Opening Stock","In","Out","Closing Stock"]
[{"$f":"IF('Item List'!A2=\"\",\"\",'Item List'!A2)","v":"196800460943"},{"$f":"IF(A2=\"\",\"\",SUMIF('Item List'!A:D,Report!A2,'Item List'!D:D))","v":136},{"$f":"IF(A2=\"\",\"\",SUMIFS(Transaction!F:F,Transaction!E:E,\"In\",Transaction!B:B,Report!A2))","v":6},{"$f":"IF(A2=\"\",\"\",SUMIFS(Transaction!F:F,Transaction!E:E,\"out\",Transaction!B:B,Report!A2))","v":7},{"$f":"IF(A2=\"\",\"\",B2+C2-D2)","v":135}]
[{"$f":"IF('Item List'!A3=\"\",\"\",'Item List'!A3)","v":"196379891780"},{"$f":"IF(A3=\"\",\"\",SUMIF('Item List'!A:D,Report!A3,'Item List'!D:D))","v":94},{"$f":"IF(A3=\"\",\"\",SUMIFS(Transaction!F:F,Transaction!E:E,\"In\",Transaction!B:B,Report!A3))","v":2},{"$f":"IF(A3=\"\",\"\",SUMIFS(Transaction!F:F,Transaction!E:E,\"out\",Transaction!B:B,Report!A3))","v":0},{"$f":"IF(A3=\"\",\"\",B3+C3-D3)","v":96}]
[{"$f":"IF('Item List'!A4=\"\",\"\",'Item List'!A4)","v":"195890378084"},{"$f":"IF(A4=\"\",\"\",SUMIF('Item List'!A:D,Report!A4,'Item List'!D:D))","v":65},{"$f":"IF(A4=\"\",\"\",SUMIFS(Transaction!F:F,Transaction!E:E,\"In\",Transaction!B:B,Report!A4))","v":0},{"$f":"IF(A4=\"\",\"\",SUMIFS(Transaction!F:F,Transaction!E:E,\"out\",Transaction!B:B,Report!A4))","v":0},65]
[{"$f":"IF('Item List'!A5=\"\",\"\",'Item List'!A5)","v":"191999722094"},{"$f":"IF(A5=\"\",\"\",SUMIF('Item List'!A:D,Report!A5,'Item List'!D:D))","v":88},{"$f":"IF(A5=\"\",\"\",SUMIFS(Transaction!F:F,Transaction!E:E,\"In\",Transaction!B:B,Report!A5))","v":0},{"$f":"IF(A5=\"\",\"\",SUMIFS(Transaction!F:F,Transaction!E:E,\"out\",Transaction!B:B,Report!A5))","v":0},88]
[{"$f":"IF('Item List'!A6=\"\",\"\",'Item List'!A6)","v":"195042086331"},{"$f":"IF(A6=\"\",\"\",SUMIF('Item List'!A:D,Report!A6,'Item List'!D:D))","v":28},{"$f":"IF(A6=\"\",\"\",SUMIFS(Transaction!F:F,Transaction!E:E,\"In\",Transaction!B:B,Report!A6))","v":0},{"$f":"IF(A6=\"\",\"\",SUMIFS(Transaction!F:F,Transaction!E:E,\"out\",Transaction!B:B,Report!A6))","v":0},28]
[{"$f":"IF('Item List'!A7=\"\",\"\",'Item List'!A7)","v":"191545242878"},{"$f":"IF(A7=\"\",\"\",SUMIF('Item List'!A:D,Report!A7,'Item List'!D:D))","v":10},{"$f":"IF(A7=\"\",\"\",SUMIFS(Transaction!F:F,Transaction!E:E,\"In\",Transaction!B:B,Report!A7))","v":0},{"$f":"IF(A7=\"\",\"\",SUMIFS(Transaction!F:F,Transaction!E:E,\"out\",Transaction!B:B,Report!A7))","v":0},10]
[{"$f":"IF('Item List'!A8=\"\",\"\",'Item List'!A8)","v":"819927012030"},{"$f":"IF(A8=\"\",\"\",SUMIF('Item List'!A:D,Report!A8,'Item List'!D:D))","v":92},{"$f":"IF(A8=\"\",\"\",SUMIFS(Transaction!F:F,Transaction!E:E,\"In\",Transaction!B:B,Report!A8))","v":0},{"$f":"IF(A8=\"\",\"\",SUMIFS(Transaction!F:F,Transaction!E:E,\"out\",Transaction!B:B,Report!A8))","v":0},92]
[{"$f":"IF('Item List'!A9=\"\",\"\",'Item List'!A9)","v":"X002I8FY7H"},{"$f":"IF(A9=\"\",\"\",SUMIF('Item List'!A:D,Report!A9,'Item List'!D:D))","v":26},{"$f":"IF(A9=\"\",\"\",SUMIFS(Transaction!F:F,Transaction!E:E,\"In\",Transaction!B:B,Report!A9))","v":0},{"$f":"IF(A9=\"\",\"\",SUMIFS(Transaction!F:F,Transaction!E:E,\"out\",Transaction!B:B,Report!A9))","v":0},26]
[{"$f":"IF('Item List'!A10=\"\",\"\",'Item List'!A10)","v":"649241924616"},{"$f":"IF(A10=\"\",\"\",SUMIF('Item List'!A:D,Report!A10,'Item List'!D:D))","v":135},{"$f":"IF(A10=\"\",\"\",SUMIFS(Transaction!F:F,Transaction!E:E,\"In\",Transaction!B:B,Report!A10))","v":0},{"$f":"IF(A10=\"\",\"\",SUMIFS(Transaction!F:F,Transaction!E:E,\"out\",Transaction!B:B,Report!A10))","v":0},135,null,null,null,null,null,"X002TUVAEZ"]
[{"$f":"IF('Item List'!A11=\"\",\"\",'Item List'!A11)","v":"97855089816"},{"$f":"IF(A11=\"\",\"\",SUMIF('Item List'!A:D,Report!A11,'Item List'!D:D))","v":10},{"$f":"IF(A11=\"\",\"\",SUMIFS(Transaction!F:F,Transaction!E:E,\"In\",Transaction!B:B,Report!A11))","v":13},{"$f":"IF(A11=\"\",\"\",SUMIFS(Transaction!F:F,Transaction!E:E,\"out\",Transaction!B:B,Report!A11))","v":0},23]
[{"$f":"IF('Item List'!A12=\"\",\"\",'Item List'!A12)","v":"731304436669"},{"$f":"IF(A12=\"\",\"\",SUMIF('Item List'!A:D,Report!A12,'Item List'!D:D))","v":67},{"$f":"IF(A12=\"\",\"\",SUMIFS(Transaction!F:F,Transaction!E:E,\"In\",Transaction!B:B,Report!A12))","v":0},{"$f":"IF(A12=\"\",\"\",SUMIFS(Transaction!F:F,Transaction!E:E,\"out\",Transaction!B:B,Report!A12))","v":0},67,null,null,null,null,null,"97855089816"]
[{"$f":"IF('Item List'!A13=\"\",\"\",'Item List'!A13)","v":"X002BGBMG3"},{"$f":"IF(A13=\"\",\"\",SUMIF('Item List'!A:D,Report!A13,'Item List'!D:D))","v":75},{"$f":"IF(A13=\"\",\"\",SUMIFS(Transaction!F:F,Transaction!E:E,\"In\",Transaction!B:B,Report!A13))","v":0},{"$f":"IF(A13=\"\",\"\",SUMIFS(Transaction!F:F,Transaction!E:E,\"out\",Transaction!B:B,Report!A13))","v":0},75]
[{"$f":"IF('Item List'!A14=\"\",\"\",'Item List'!A14)","v":"X002TUVAEZ"},{"$f":"IF(A14=\"\",\"\",SUMIF('Item List'!A:D,Report!A14,'Item List'!D:D))","v":128},{"$f":"IF(A14=\"\",\"\",SUMIFS(Transaction!F:F,Transaction!E:E,\"In\",Transaction!B:B,Report!A14))","v":14},{"$f":"IF(A14=\"\",\"\",SUMIFS(Transaction!F:F,Transaction!E:E,\"out\",Transaction!B:B,Report!A14))","v":11},131]
[{"$f":"IF('Item List'!A15=\"\",\"\",'Item List'!A15)","v":"X002MVT2X7"},{"$f":"IF(A15=\"\",\"\",SUMIF('Item List'!A:D,Report!A15,'Item List'!D:D))","v":99},{"$f":"IF(A15=\"\",\"\",SUMIFS(Transaction!F:F,Transaction!E:E,\"In\",Transaction!B:B,Report!A15))","v":0},{"$f":"IF(A15=\"\",\"\",SUMIFS(Transaction!F:F,Transaction!E:E,\"out\",Transaction!B:B,Report!A15))","v":0},99]
[{"$f":"IF('Item List'!A16=\"\",\"\",'Item List'!A16)","v":"194252027943"},{"$f":"IF(A16=\"\",\"\",SUMIF('Item List'!A:D,Report!A16,'Item List'!D:D))","v":99},{"$f":"IF(A16=\"\",\"\",SUMIFS(Transaction!F:F,Transaction!E:E,\"In\",Transaction!B:B,Report!A16))","v":0},{"$f":"IF(A16=\"\",\"\",SUMIFS(Transaction!F:F,Transaction!E:E,\"out\",Transaction!B:B,Report!A16))","v":0},99]
[{"$f":"IF('Item List'!A17=\"\",\"\",'Item List'!A17)","v":"194252515655"},{"$f":"IF(A17=\"\",\"\",SUMIF('Item List'!A:D,Report!A17,'Item List'!D:D))","v":99},{"$f":"IF(A17=\"\",\"\",SUMIFS(Transaction!F:F,Transaction!E:E,\"In\",Transaction!B:B,Report!A17))","v":0},{"$f":"IF(A17=\"\",\"\",SUMIFS(Transaction!F:F,Transaction!E:E,\"out\",Transaction!B:B,Report!A17))","v":0},99]
[{"$f":"IF('Item List'!A18=\"\",\"\",'Item List'!A18)","v":"191927887857"},{"$f":"IF(A18=\"\",\"\",SUMIF('Item List'!A:D,Report!A18,'Item List'!D:D))","v":99},{"$f":"IF(A18=\"\",\"\",SUMIFS(Transaction!F:F,Transaction!E:E,\"In\",Transaction!B:B,Report!A18))","v":0},{"$f":"IF(A18=\"\",\"\",SUMIFS(Transaction!F:F,Transaction!E:E,\"out\",Transaction!B:B,Report!A18))","v":0},99]
[{"$f":"IF('Item List'!A19=\"\",\"\",'Item List'!A19)","v":"X0031MJNVR"},{"$f":"IF(A19=\"\",\"\",SUMIF('Item List'!A:D,Report!A19,'Item List'!D:D))","v":99},{"$f":"IF(A19=\"\",\"\",SUMIFS(Transaction!F:F,Transaction!E:E,\"In\",Transaction!B:B,Report!A19))","v":0},{"$f":"IF(A19=\"\",\"\",SUMIFS(Transaction!F:F,Transaction!E:E,\"out\",Transaction!B:B,Report!A19))","v":0},99]
[{"$f":"IF('Item List'!A20=\"\",\"\",'Item List'!A20)","v":"X002XG9VRD"},{"$f":"IF(A20=\"\",\"\",SUMIF('Item List'!A:D,Report!A20,'Item List'!D:D))","v":99},{"$f":"IF(A20=\"\",\"\",SUMIFS(Transaction!F:F,Transaction!E:E,\"In\",Transaction!B:B,Report!A20))","v":0},{"$f":"IF(A20=\"\",\"\",SUMIFS(Transaction!F:F,Transaction!E:E,\"out\",Transaction!B:B,Report!A20))","v":0},99]
[{"$f":"IF('Item List'!A21=\"\",\"\",'Item List'!A21)","v":"X002IYQQWX"},{"$f":"IF(A21=\"\",\"\",SUMIF('Item List'!A:D,Report!A21,'Item List'!D:D))","v":99},{"$f":"IF(A21=\"\",\"\",SUMIFS(Transaction!F:F,Transaction!E:E,\"In\",Transaction!B:B,Report!A21))","v":0},{"$f":"IF(A21=\"\",\"\",SUMIFS(Transaction!F:F,Transaction!E:E,\"out\",Transaction!B:B,Report!A21))","v":0},99]
[{"$f":"IF('Item List'!A22=\"\",\"\",'Item List'!A22)","v":"649528903617"},{"$f":"IF(A22=\"\",\"\",SUMIF('Item List'!A:D,Report!A22,'Item List'!D:D))","v":99},{"$f":"IF(A22=\"\",\"\",SUMIFS(Transaction!F:F,Transaction!E:E,\"In\",Transaction!B:B,Report!A22))","v":0},{"$f":"IF(A22=\"\",\"\",SUMIFS(Transaction!F:F,Transaction!E:E,\"out\",Transaction!B:B,Report!A22))","v":0},99]
[{"$f":"IF('Item List'!A23=\"\",\"\",'Item List'!A23)","v":"X002CAXF3V"},{"$f":"IF(A23=\"\",\"\",SUMIF('Item List'!A:D,Report!A23,'Item List'!D:D))","v":99},{"$f":"IF(A23=\"\",\"\",SUMIFS(Transaction!F:F,Transaction!E:E,\"In\",Transaction!B:B,Report!A23))","v":0},{"$f":"IF(A23=\"\",\"\",SUMIFS(Transaction!F:F,Transaction!E:E,\"out\",Transaction!B:B,Report!A23))","v":0},99]
[{"$f":"IF('Item List'!A24=\"\",\"\",'Item List'!A24)","v":"191999722124"},{"$f":"IF(A24=\"\",\"\",SUMIF('Item List'!A:D,Report!A24,'Item List'!D:D))","v":99},{"$f":"IF(A24=\"\",\"\",SUMIFS(Transaction!F:F,Transaction!E:E,\"In\",Transaction!B:B,Report!A24))","v":0},{"$f":"IF(A24=\"\",\"\",SUMIFS(Transaction!F:F,Transaction!E:E,\"out\",Transaction!B:B,Report!A24))","v":0},99]
[{"$f":"IF('Item List'!A25=\"\",\"\",'Item List'!A25)","v":""},{"$f":"IF(A25=\"\",\"\",SUMIF('Item List'!A:D,Report!A25,'Item List'!D:D))","v":""},{"$f":"IF(A25=\"\",\"\",SUMIFS(Transaction!F:F,Transaction!E:E,\"In\",Transaction!B:B,Report!A25))","v":""},{"$f":"IF(A25=\"\",\"\",SUMIFS(Transaction!F:F,Transaction!E:E,\"out\",Transaction!B:B,Report!A25))","v":""},""]
[{"$f":"IF('Item List'!A26=\"\",\"\",'Item List'!A26)","v":""},{"$f":"IF(A26=\"\",\"\",SUMIF('Item List'!A:D,Report!A26,'Item List'!D:D))","v":""},{"$f":"IF(A26=\"\",\"\",SUMIFS(Transaction!F:F,Transaction!E:E,\"In\",Transaction!B:B,Report!A26))","v":""},{"$f":"IF(A26=\"\",\"\",SUMIFS(Transaction!F:F,Transaction!E:E,\"out\",Transaction!B:B,Report!A26))","v":""},""]
[{"$f":"IF('Item List'!A27=\"\",\"\",'Item List'!A27)","v":""},{"$f":"IF(A27=\"\",\"\",SUMIF('Item List'!A:D,Report!A27,'Item List'!D:D))","v":""},{"$f":"IF(A27=\"\",\"\",SUMIFS(Transaction!F:F,Transaction!E:E,\"In\",Transaction!B:B,Report!A27))","v":""},{"$f":"IF(A27=\"\",\"\",SUMIFS(Transaction!F:F,Transaction!E:E,\"out\",Transaction!B:B,Report!A27))","v":""},""]
[{"$f":"IF('Item List'!A28=\"\",\"\",'Item List'!A28)","v":""},{"$f":"IF(A28=\"\",\"\",SUMIF('Item List'!A:D,Report!A28,'Item List'!D:D))","v":""},{"$f":"IF(A28=\"\",\"\",SUMIFS(Transaction!F:F,Transaction!E:E,\"In\",Transaction!B:B,Report!A28))","v":""},{"$f":"IF(A28=\"\",\"\",SUMIFS(Transaction!F:F,Transaction!E:E,\"out\",Transaction!B:B,Report!A28))","v":""},""]
[{"$f":"IF('Item List'!A29=\"\",\"\",'Item List'!A29)","v":""},{"$f":"IF(A29=\"\",\"\",SUMIF('Item List'!A:D,Report!A29,'Item List'!D:D))","v":""},{"$f":"IF(A29=\"\",\"\",SUMIFS(Transaction!F:F,Transaction!E:E,\"In\",Transaction!B:B,Report!A29))","v":""},{"$f":"IF(A29=\"\",\"\",SUMIFS(Transaction!F:F,Transaction!E:E,\"out\",Transaction!B:B,Report!A29))","v":""},""]
[{"$f":"IF('Item List'!A30=\"\",\"\",'Item List'!A30)","v":""},{"$f":"IF(A30=\"\",\"\",SUMIF('Item List'!A:D,Report!A30,'Item List'!D:D))","v":""},{"$f":"IF(A30=\"\",\"\",SUMIFS(Transaction!F:F,Transaction!E:E,\"In\",Transaction!B:B,Report!A30))","v":""},{"$f":"IF(A30=\"\",\"\",SUMIFS(Transaction!F:F,Transaction!E:E,\"out\",Transaction!B:B,Report!A30))","v":""},""]
[{"$f":"IF('Item List'!A31=\"\",\"\",'Item List'!A31)","v":""},{"$f":"IF(A31=\"\",\"\",SUMIF('Item List'!A:D,Report!A31,'Item List'!D:D))","v":""},{"$f":"IF(A31=\"\",\"\",SUMIFS(Transaction!F:F,Transaction!E:E,\"In\",Transaction!B:B,Report!A31))","v":""},{"$f":"IF(A31=\"\",\"\",SUMIFS(Transaction!F:F,Transaction!E:E,\"out\",Transaction!B:B,Report!A31))","v":""},""]
[{"$f":"IF('Item List'!A32=\"\",\"\",'Item List'!A32)","v":""},{"$f":"IF(A32=\"\",\"\",SUMIF('Item List'!A:D,Report!A32,'Item List'!D:D))","v":""},{"$f":"IF(A32=\"\",\"\",SUMIFS(Transaction!F:F,Transaction!E:E,\"In\",Transaction!B:B,Report!A32))","v":""},{"$f":"IF(A32=\"\",\"\",SUMIFS(Transaction!F:F,Transaction!E:E,\"out\",Transaction!B:B,Report!A32))","v":""},""]
[{"$f":"IF('Item List'!A33=\"\",\"\",'Item List'!A33)","v":""},{"$f":"IF(A33=\"\",\"\",SUMIF('Item List'!A:D,Report!A33,'Item List'!D:D))","v":""},{"$f":"IF(A33=\"\",\"\",SUMIFS(Transaction!F:F,Transaction!E:E,\"In\",Transaction!B:B,Report!A33))","v":""},{"$f":"IF(A33=\"\",\"\",SUMIFS(Transaction!F:F,Transaction!E:E,\"out\",Transaction!B:B,Report!A33))","v":""},""]
[{"$f":"IF('Item List'!A34=\"\",\"\",'Item List'!A34)","v":""},{"$f":"IF(A34=\"\",\"\",SUMIF('Item List'!A:D,Report!A34,'Item List'!D:D))","v":""},{"$f":"IF(A34=\"\",\"\",SUMIFS(Transaction!F:F,Transaction!E:E,\"In\",Transaction!B:B,Report!A34))","v":""},{"$f":"IF(A34=\"\",\"\",SUMIFS(Transaction!F:F,Transaction!E:E,\"out\",Transaction!B:B,Report!A34))","v":""},""]
[{"$f":"IF('Item List'!A35=\"\",\"\",'Item List'!A35)","v":""},{"$f":"IF(A35=\"\",\"\",SUMIF('Item List'!A:D,Report!A35,'Item List'!D:D))","v":""},{"$f":"IF(A35=\"\",\"\",SUMIFS(Transaction!F:F,Transaction!E:E,\"In\",Transaction!B:B,Report!A35))","v":""},{"$f":"IF(A35=\"\",\"\",SUMIFS(Transaction!F:F,Transaction!E:E,\"out\",Transaction!B:B,Report!A35))","v":""},""]
[{"$f":"IF('Item List'!A36=\"\",\"\",'Item List'!A36)","v":""},{"$f":"IF(A36=\"\",\"\",SUMIF('Item List'!A:D,Report!A36,'Item List'!D:D))","v":""},{"$f":"IF(A36=\"\",\"\",SUMIFS(Transaction!F:F,Transaction!E:E,\"In\",Transaction!B:B,Report!A36))","v":""},{"$f":"IF(A36=\"\",\"\",SUMIFS(Transaction!F:F,Transaction!E:E,\"out\",Transaction!B:B,Report!A36))","v":""},""]
[{"$f":"IF('Item List'!A37=\"\",\"\",'Item List'!A37)","v":""},{"$f":"IF(A37=\"\",\"\",SUMIF('Item List'!A:D,Report!A37,'Item List'!D:D))","v":""},{"$f":"IF(A37=\"\",\"\",SUMIFS(Transaction!F:F,Transaction!E:E,\"In\",Transaction!B:B,Report!A37))","v":""},{"$f":"IF(A37=\"\",\"\",SUMIFS(Transaction!F:F,Transaction!E:E,\"out\",Transaction!B:B,Report!A37))","v":""},""]
[{"$f":"IF('Item List'!A38=\"\",\"\",'Item List'!A38)","v":""},{"$f":"IF(A38=\"\",\"\",SUMIF('Item List'!A:D,Report!A38,'Item List'!D:D))","v":""},{"$f":"IF(A38=\"\",\"\",SUMIFS(Transaction!F:F,Transaction!E:E,\"In\",Transaction!B:B,Report!A38))","v":""},{"$f":"IF(A38=\"\",\"\",SUMIFS(Transaction!F:F,Transaction!E:E,\"out\",Transaction!B:B,Report!A38))","v":""},""]
[{"$f":"IF('Item List'!A39=\"\",\"\",'Item List'!A39)","v":""},{"$f":"IF(A39=\"\",\"\",SUMIF('Item List'!A:D,Report!A39,'Item List'!D:D))","v":""},{"$f":"IF(A39=\"\",\"\",SUMIFS(Transaction!F:F,Transaction!E:E,\"In\",Transaction!B:B,Report!A39))","v":""},{"$f":"IF(A39=\"\",\"\",SUMIFS(Transaction!F:F,Transaction!E:E,\"out\",Transaction!B:B,Report!A39))","v":""},""]
[{"$f":"IF('Item List'!A40=\"\",\"\",'Item List'!A40)","v":""},{"$f":"IF(A40=\"\",\"\",SUMIF('Item List'!A:D,Report!A40,'Item List'!D:D))","v":""},{"$f":"IF(A40=\"\",\"\",SUMIFS(Transaction!F:F,Transaction!E:E,\"In\",Transaction!B:B,Report!A40))","v":""},{"$f":"IF(A40=\"\",\"\",SUMIFS(Transaction!F:F,Transaction!E:E,\"out\",Transaction!B:B,Report!A40))","v":""},""]
[{"$f":"IF('Item List'!A41=\"\",\"\",'Item List'!A41)","v":""},{"$f":"IF(A41=\"\",\"\",SUMIF('Item List'!A:D,Report!A41,'Item List'!D:D))","v":""},{"$f":"IF(A41=\"\",\"\",SUMIFS(Transaction!F:F,Transaction!E:E,\"In\",Transaction!B:B,Report!A41))","v":""},{"$f":"IF(A41=\"\",\"\",SUMIFS(Transaction!F:F,Transaction!E:E,\"out\",Transaction!B:B,Report!A41))","v":""},""]
[{"$f":"IF('Item List'!A42=\"\",\"\",'Item List'!A42)","v":""},{"$f":"IF(A42=\"\",\"\",SUMIF('Item List'!A:D,Report!A42,'Item List'!D:D))","v":""},{"$f":"IF(A42=\"\",\"\",SUMIFS(Transaction!F:F,Transaction!E:E,\"In\",Transaction!B:B,Report!A42))","v":""},{"$f":"IF(A42=\"\",\"\",SUMIFS(Transaction!F:F,Transaction!E:E,\"out\",Transaction!B:B,Report!A42))","v":""},""]
[{"$f":"IF('Item List'!A43=\"\",\"\",'Item List'!A43)","v":""},{"$f":"IF(A43=\"\",\"\",SUMIF('Item List'!A:D,Report!A43,'Item List'!D:D))","v":""},{"$f":"IF(A43=\"\",\"\",SUMIFS(Transaction!F:F,Transaction!E:E,\"In\",Transaction!B:B,Report!A43))","v":""},{"$f":"IF(A43=\"\",\"\",SUMIFS(Transaction!F:F,Transaction!E:E,\"out\",Transaction!B:B,Report!A43))","v":""},""]
[{"$f":"IF('Item List'!A44=\"\",\"\",'Item List'!A44)","v":""},{"$f":"IF(A44=\"\",\"\",SUMIF('Item List'!A:D,Report!A44,'Item List'!D:D))","v":""},{"$f":"IF(A44=\"\",\"\",SUMIFS(Transaction!F:F,Transaction!E:E,\"In\",Transaction!B:B,Report!A44))","v":""},{"$f":"IF(A44=\"\",\"\",SUMIFS(Transaction!F:F,Transaction!E:E,\"out\",Transaction!B:B,Report!A44))","v":""},""]
[{"$f":"IF('Item List'!A45=\"\",\"\",'Item List'!A45)","v":""},{"$f":"IF(A45=\"\",\"\",SUMIF('Item List'!A:D,Report!A45,'Item List'!D:D))","v":""},{"$f":"IF(A45=\"\",\"\",SUMIFS(Transaction!F:F,Transaction!E:E,\"In\",Transaction!B:B,Report!A45))","v":""},{"$f":"IF(A45=\"\",\"\",SUMIFS(Transaction!F:F,Transaction!E:E,\"out\",Transaction!B:B,Report!A45))","v":""},""]
[{"$f":"IF('Item List'!A46=\"\",\"\",'Item List'!A46)","v":""},{"$f":"IF(A46=\"\",\"\",SUMIF('Item List'!A:D,Report!A46,'Item List'!D:D))","v":""},{"$f":"IF(A46=\"\",\"\",SUMIFS(Transaction!F:F,Transaction!E:E,\"In\",Transaction!B:B,Report!A46))","v":""},{"$f":"IF(A46=\"\",\"\",SUMIFS(Transaction!F:F,Transaction!E:E,\"out\",Transaction!B:B,Report!A46))","v":""},""]
[{"$f":"IF('Item List'!A47=\"\",\"\",'Item List'!A47)","v":""},{"$f":"IF(A47=\"\",\"\",SUMIF('Item List'!A:D,Report!A47,'Item List'!D:D))","v":""},{"$f":"IF(A47=\"\",\"\",SUMIFS(Transaction!F:F,Transaction!E:E,\"In\",Transaction!B:B,Report!A47))","v":""},{"$f":"IF(A47=\"\",\"\",SUMIFS(Transaction!F:F,Transaction!E:E,\"out\",Transaction!B:B,Report!A47))","v":""},""]
[{"$f":"IF('Item List'!A48=\"\",\"\",'Item List'!A48)","v":""},{"$f":"IF(A48=\"\",\"\",SUMIF('Item List'!A:D,Report!A48,'Item List'!D:D))","v":""},{"$f":"IF(A48=\"\",\"\",SUMIFS(Transaction!F:F,Transaction!E:E,\"In\",Transaction!B:B,Report!A48))","v":""},{"$f":"IF(A48=\"\",\"\",SUMIFS(Transaction!F:F,Transaction!E:E,\"out\",Transaction!B:B,Report!A48))","v":""},""]
[{"$f":"IF('Item List'!A49=\"\",\"\",'Item List'!A49)","v":""},{"$f":"IF(A49=\"\",\"\",SUMIF('Item List'!A:D,Report!A49,'Item List'!D:D))","v":""},{"$f":"IF(A49=\"\",\"\",SUMIFS(Transaction!F:F,Transaction!E:E,\"In\",Transaction!B:B,Report!A49))","v":""},{"$f":"IF(A49=\"\",\"\",SUMIFS(Transaction!F:F,Transaction!E:E,\"out\",Transaction!B:B,Report!A49))","v":""},""]
[{"$f":"IF('Item List'!A50=\"\",\"\",'Item List'!A50)","v":""},{"$f":"IF(A50=\"\",\"\",SUMIF('Item List'!A:D,Report!A50,'Item List'!D:D))","v":""},{"$f":"IF(A50=\"\",\"\",SUMIFS(Transaction!F:F,Transaction!E:E,\"In\",Transaction!B:B,Report!A50))","v":""},{"$f":"IF(A50=\"\",\"\",SUMIFS(Transaction!F:F,Transaction!E:E,\"out\",Transaction!B:B,Report!A50))","v":""},""]
[{"$f":"IF('Item List'!A51=\"\",\"\",'Item List'!A51)","v":""},{"$f":"IF(A51=\"\",\"\",SUMIF('Item List'!A:D,Report!A51,'Item List'!D:D))","v":""},{"$f":"IF(A51=\"\",\"\",SUMIFS(Transaction!F:F,Transaction!E:E,\"In\",Transaction!B:B,Report!A51))","v":""},{"$f":"IF(A51=\"\",\"\",SUMIFS(Transaction!F:F,Transaction!E:E,\"out\",Transaction!B:B,Report!A51))","v":""},""]
[{"$f":"IF('Item List'!A52=\"\",\"\",'Item List'!A52)","v":""},{"$f":"IF(A52=\"\",\"\",SUMIF('Item List'!A:D,Report!A52,'Item List'!D:D))","v":""},{"$f":"IF(A52=\"\",\"\",SUMIFS(Transaction!F:F,Transaction!E:E,\"In\",Transaction!B:B,Report!A52))","v":""},{"$f":"IF(A52=\"\",\"\",SUMIFS(Transaction!F:F,Transaction!E:E,\"out\",Transaction!B:B,Report!A52))","v":""},""]
[{"$f":"IF('Item List'!A53=\"\",\"\",'Item List'!A53)","v":""},{"$f":"IF(A53=\"\",\"\",SUMIF('Item List'!A:D,Report!A53,'Item List'!D:D))","v":""},{"$f":"IF(A53=\"\",\"\",SUMIFS(Transaction!F:F,Transaction!E:E,\"In\",Transaction!B:B,Report!A53))","v":""},{"$f":"IF(A53=\"\",\"\",SUMIFS(Transaction!F:F,Transaction!E:E,\"out\",Transaction!B:B,Report!A53))","v":""},""]
[{"$f":"IF('Item List'!A54=\"\",\"\",'Item List'!A54)","v":""},{"$f":"IF(A54=\"\",\"\",SUMIF('Item List'!A:D,Report!A54,'Item List'!D:D))","v":""},{"$f":"IF(A54=\"\",\"\",SUMIFS(Transaction!F:F,Transaction!E:E,\"In\",Transaction!B:B,Report!A54))","v":""},{"$f":"IF(A54=\"\",\"\",SUMIFS(Transaction!F:F,Transaction!E:E,\"out\",Transaction!B:B,Report!A54))","v":""},""]
[{"$f":"IF('Item List'!A55=\"\",\"\",'Item List'!A55)","v":""},{"$f":"IF(A55=\"\",\"\",SUMIF('Item List'!A:D,Report!A55,'Item List'!D:D))","v":""},{"$f":"IF(A55=\"\",\"\",SUMIFS(Transaction!F:F,Transaction!E:E,\"In\",Transaction!B:B,Report!A55))","v":""},{"$f":"IF(A55=\"\",\"\",SUMIFS(Transaction!F:F,Transaction!E:E,\"out\",Transaction!B:B,Report!A55))","v":""},""]
[{"$f":"IF('Item List'!A56=\"\",\"\",'Item List'!A56)","v":""},{"$f":"IF(A56=\"\",\"\",SUMIF('Item List'!A:D,Report!A56,'Item List'!D:D))","v":""},{"$f":"IF(A56=\"\",\"\",SUMIFS(Transaction!F:F,Transaction!E:E,\"In\",Transaction!B:B,Report!A56))","v":""},{"$f":"IF(A56=\"\",\"\",SUMIFS(Transaction!F:F,Transaction!E:E,\"out\",Transaction!B:B,Report!A56))","v":""},""]
[{"$f":"IF('Item List'!A57=\"\",\"\",'Item List'!A57)","v":""},{"$f":"IF(A57=\"\",\"\",SUMIF('Item List'!A:D,Report!A57,'Item List'!D:D))","v":""},{"$f":"IF(A57=\"\",\"\",SUMIFS(Transaction!F:F,Transaction!E:E,\"In\",Transaction!B:B,Report!A57))","v":""},{"$f":"IF(A57=\"\",\"\",SUMIFS(Transaction!F:F,Transaction!E:E,\"out\",Transaction!B:B,Report!A57))","v":""},""]
[{"$f":"IF('Item List'!A58=\"\",\"\",'Item List'!A58)","v":""},{"$f":"IF(A58=\"\",\"\",SUMIF('Item List'!A:D,Report!A58,'Item List'!D:D))","v":""},{"$f":"IF(A58=\"\",\"\",SUMIFS(Transaction!F:F,Transaction!E:E,\"In\",Transaction!B:B,Report!A58))","v":""},{"$f":"IF(A58=\"\",\"\",SUMIFS(Transaction!F:F,Transaction!E:E,\"out\",Transaction!B:B,Report!A58))","v":""},""]
[{"$f":"IF('Item List'!A59=\"\",\"\",'Item List'!A59)","v":""},{"$f":"IF(A59=\"\",\"\",SUMIF('Item List'!A:D,Report!A59,'Item List'!D:D))","v":""},{"$f":"IF(A59=\"\",\"\",SUMIFS(Transaction!F:F,Transaction!E:E,\"In\",Transaction!B:B,Report!A59))","v":""},{"$f":"IF(A59=\"\",\"\",SUMIFS(Transaction!F:F,Transaction!E:E,\"out\",Transaction!B:B,Report!A59))","v":""},""]
[{"$f":"IF('Item List'!A60=\"\",\"\",'Item List'!A60)","v":""},{"$f":"IF(A60=\"\",\"\",SUMIF('Item List'!A:D,Report!A60,'Item List'!D:D))","v":""},{"$f":"IF(A60=\"\",\"\",SUMIFS(Transaction!F:F,Transaction!E:E,\"In\",Transaction!B:B,Report!A60))","v":""},{"$f":"IF(A60=\"\",\"\",SUMIFS(Transaction!F:F,Transaction!E:E,\"out\",Transaction!B:B,Report!A60))","v":""},""]
[{"$f":"IF('Item List'!A61=\"\",\"\",'Item List'!A61)","v":""},{"$f":"IF(A61=\"\",\"\",SUMIF('Item List'!A:D,Report!A61,'Item List'!D:D))","v":""},{"$f":"IF(A61=\"\",\"\",SUMIFS(Transaction!F:F,Transaction!E:E,\"In\",Transaction!B:B,Report!A61))","v":""},{"$f":"IF(A61=\"\",\"\",SUMIFS(Transaction!F:F,Transaction!E:E,\"out\",Transaction!B:B,Report!A61))","v":""},""]
[{"$f":"IF('Item List'!A62=\"\",\"\",'Item List'!A62)","v":""},{"$f":"IF(A62=\"\",\"\",SUMIF('Item List'!A:D,Report!A62,'Item List'!D:D))","v":""},{"$f":"IF(A62=\"\",\"\",SUMIFS(Transaction!F:F,Transaction!E:E,\"In\",Transaction!B:B,Report!A62))","v":""},{"$f":"IF(A62=\"\",\"\",SUMIFS(Transaction!F:F,Transaction!E:E,\"out\",Transaction!B:B,Report!A62))","v":""},""]
[{"$f":"IF('Item List'!A63=\"\",\"\",'Item List'!A63)","v":""},{"$f":"IF(A63=\"\",\"\",SUMIF('Item List'!A:D,Report!A63,'Item List'!D:D))","v":""},{"$f":"IF(A63=\"\",\"\",SUMIFS(Transaction!F:F,Transaction!E:E,\"In\",Transaction!B:B,Report!A63))","v":""},{"$f":"IF(A63=\"\",\"\",SUMIFS(Transaction!F:F,Transaction!E:E,\"out\",Transaction!B:B,Report!A63))","v":""},""]
[{"$f":"IF('Item List'!A64=\"\",\"\",'Item List'!A64)","v":""},{"$f":"IF(A64=\"\",\"\",SUMIF('Item List'!A:D,Report!A64,'Item List'!D:D))","v":""},{"$f":"IF(A64=\"\",\"\",SUMIFS(Transaction!F:F,Transaction!E:E,\"In\",Transaction!B:B,Report!A64))","v":""},{"$f":"IF(A64=\"\",\"\",SUMIFS(Transaction!F:F,Transaction!E:E,\"out\",Transaction!B:B,Report!A64))","v":""},""]
[{"$f":"IF('Item List'!A65=\"\",\"\",'Item List'!A65)","v":""},{"$f":"IF(A65=\"\",\"\",SUMIF('Item List'!A:D,Report!A65,'Item List'!D:D))","v":""},{"$f":"IF(A65=\"\",\"\",SUMIFS(Transaction!F:F,Transaction!E:E,\"In\",Transaction!B:B,Report!A65))","v":""},{"$f":"IF(A65=\"\",\"\",SUMIFS(Transaction!F:F,Transaction!E:E,\"out\",Transaction!B:B,Report!A65))","v":""},""]
[{"$f":"IF('Item List'!A66=\"\",\"\",'Item List'!A66)","v":""},{"$f":"IF(A66=\"\",\"\",SUMIF('Item List'!A:D,Report!A66,'Item List'!D:D))","v":""},{"$f":"IF(A66=\"\",\"\",SUMIFS(Transaction!F:F,Transaction!E:E,\"In\",Transaction!B:B,Report!A66))","v":""},{"$f":"IF(A66=\"\",\"\",SUMIFS(Transaction!F:F,Transaction!E:E,\"out\",Transaction!B:B,Report!A66))","v":""},""]
[{"$f":"IF('Item List'!A67=\"\",\"\",'Item List'!A67)","v":""},{"$f":"IF(A67=\"\",\"\",SUMIF('Item List'!A:D,Report!A67,'Item List'!D:D))","v":""},{"$f":"IF(A67=\"\",\"\",SUMIFS(Transaction!F:F,Transaction!E:E,\"In\",Transaction!B:B,Report!A67))","v":""},{"$f":"IF(A67=\"\",\"\",SUMIFS(Transaction!F:F,Transaction!E:E,\"out\",Transaction!B:B,Report!A67))","v":""},{"$f":"IF(A67=\"\",\"\",B67+C67-D67)","v":""}]
[{"$f":"IF('Item List'!A68=\"\",\"\",'Item List'!A68)","v":""},{"$f":"IF(A68=\"\",\"\",SUMIF('Item List'!A:D,Report!A68,'Item List'!D:D))","v":""},{"$f":"IF(A68=\"\",\"\",SUMIFS(Transaction!F:F,Transaction!E:E,\"In\",Transaction!B:B,Report!A68))","v":""},{"$f":"IF(A68=\"\",\"\",SUMIFS(Transaction!F:F,Transaction!E:E,\"out\",Transaction!B:B,Report!A68))","v":""},""]
[{"$f":"IF('Item List'!A69=\"\",\"\",'Item List'!A69)","v":""},{"$f":"IF(A69=\"\",\"\",SUMIF('Item List'!A:D,Report!A69,'Item List'!D:D))","v":""},{"$f":"IF(A69=\"\",\"\",SUMIFS(Transaction!F:F,Transaction!E:E,\"In\",Transaction!B:B,Report!A69))","v":""},{"$f":"IF(A69=\"\",\"\",SUMIFS(Transaction!F:F,Transaction!E:E,\"out\",Transaction!B:B,Report!A69))","v":""},""]
[{"$f":"IF('Item List'!A70=\"\",\"\",'Item List'!A70)","v":""},{"$f":"IF(A70=\"\",\"\",SUMIF('Item List'!A:D,Report!A70,'Item List'!D:D))","v":""},{"$f":"IF(A70=\"\",\"\",SUMIFS(Transaction!F:F,Transaction!E:E,\"In\",Transaction!B:B,Report!A70))","v":""},{"$f":"IF(A70=\"\",\"\",SUMIFS(Transaction!F:F,Transaction!E:E,\"out\",Transaction!B:B,Report!A70))","v":""},""]
[{"$f":"IF('Item List'!A71=\"\",\"\",'Item List'!A71)","v":""},{"$f":"IF(A71=\"\",\"\",SUMIF('Item List'!A:D,Report!A71,'Item List'!D:D))","v":""},{"$f":"IF(A71=\"\",\"\",SUMIFS(Transaction!F:F,Transaction!E:E,\"In\",Transaction!B:B,Report!A71))","v":""},{"$f":"IF(A71=\"\",\"\",SUMIFS(Transaction!F:F,Transaction!E:E,\"out\",Transaction!B:B,Report!A71))","v":""},""]
[{"$f":"IF('Item List'!A72=\"\",\"\",'Item List'!A72)","v":""},{"$f":"IF(A72=\"\",\"\",SUMIF('Item List'!A:D,Report!A72,'Item List'!D:D))","v":""},{"$f":"IF(A72=\"\",\"\",SUMIFS(Transaction!F:F,Transaction!E:E,\"In\",Transaction!B:B,Report!A72))","v":""},{"$f":"IF(A72=\"\",\"\",SUMIFS(Transaction!F:F,Transaction!E:E,\"out\",Transaction!B:B,Report!A72))","v":""},""]
[{"$f":"IF('Item List'!A73=\"\",\"\",'Item List'!A73)","v":""},{"$f":"IF(A73=\"\",\"\",SUMIF('Item List'!A:D,Report!A73,'Item List'!D:D))","v":""},{"$f":"IF(A73=\"\",\"\",SUMIFS(Transaction!F:F,Transaction!E:E,\"In\",Transaction!B:B,Report!A73))","v":""},{"$f":"IF(A73=\"\",\"\",SUMIFS(Transaction!F:F,Transaction!E:E,\"out\",Transaction!B:B,Report!A73))","v":""},""]
[{"$f":"IF('Item List'!A74=\"\",\"\",'Item List'!A74)","v":""},{"$f":"IF(A74=\"\",\"\",SUMIF('Item List'!A:D,Report!A74,'Item List'!D:D))","v":""},{"$f":"IF(A74=\"\",\"\",SUMIFS(Transaction!F:F,Transaction!E:E,\"In\",Transaction!B:B,Report!A74))","v":""},{"$f":"IF(A74=\"\",\"\",SUMIFS(Transaction!F:F,Transaction!E:E,\"out\",Transaction!B:B,Report!A74))","v":""},""]
[{"$f":"IF('Item List'!A75=\"\",\"\",'Item List'!A75)","v":""},{"$f":"IF(A75=\"\",\"\",SUMIF('Item List'!A:D,Report!A75,'Item List'!D:D))","v":""},{"$f":"IF(A75=\"\",\"\",SUMIFS(Transaction!F:F,Transaction!E:E,\"In\",Transaction!B:B,Report!A75))","v":""},{"$f":"IF(A75=\"\",\"\",SUMIFS(Transaction!F:F,Transaction!E:E,\"out\",Transaction!B:B,Report!A75))","v":""},""]
[{"$f":"IF('Item List'!A76=\"\",\"\",'Item List'!A76)","v":""},{"$f":"IF(A76=\"\",\"\",SUMIF('Item List'!A:D,Report!A76,'Item List'!D:D))","v":""},{"$f":"IF(A76=\"\",\"\",SUMIFS(Transaction!F:F,Transaction!E:E,\"In\",Transaction!B:B,Report!A76))","v":""},{"$f":"IF(A76=\"\",\"\",SUMIFS(Transaction!F:F,Transaction!E:E,\"out\",Transaction!B:B,Report!A76))","v":""},""]
[{"$f":"IF('Item List'!A77=\"\",\"\",'Item List'!A77)","v":""},{"$f":"IF(A77=\"\",\"\",SUMIF('Item List'!A:D,Report!A77,'Item List'!D:D))","v":""},{"$f":"IF(A77=\"\",\"\",SUMIFS(Transaction!F:F,Transaction!E:E,\"In\",Transaction!B:B,Report!A77))","v":""},{"$f":"IF(A77=\"\",\"\",SUMIFS(Transaction!F:F,Transaction!E:E,\"out\",Transaction!B:B,Report!A77))","v":""},""]
[{"$f":"IF('Item List'!A78=\"\",\"\",'Item List'!A78)","v":""},{"$f":"IF(A78=\"\",\"\",SUMIF('Item List'!A:D,Report!A78,'Item List'!D:D))","v":""},{"$f":"IF(A78=\"\",\"\",SUMIFS(Transaction!F:F,Transaction!E:E,\"In\",Transaction!B:B,Report!A78))","v":""},{"$f":"IF(A78=\"\",\"\",SUMIFS(Transaction!F:F,Transaction!E:E,\"out\",Transaction!B:B,Report!A78))","v":""},""]
[{"$f":"IF('Item List'!A79=\"\",\"\",'Item List'!A79)","v":""},{"$f":"IF(A79=\"\",\"\",SUMIF('Item List'!A:D,Report!A79,'Item List'!D:D))","v":""},{"$f":"IF(A79=\"\",\"\",SUMIFS(Transaction!F:F,Transaction!E:E,\"In\",Transaction!B:B,Report!A79))","v":""},{"$f":"IF(A79=\"\",\"\",SUMIFS(Transaction!F:F,Transaction!E:E,\"out\",Transaction!B:B,Report!A79))","v":""},""]
[{"$f":"IF('Item List'!A80=\"\",\"\",'Item List'!A80)","v":""},{"$f":"IF(A80=\"\",\"\",SUMIF('Item List'!A:D,Report!A80,'Item List'!D:D))","v":""},{"$f":"IF(A80=\"\",\"\",SUMIFS(Transaction!F:F,Transaction!E:E,\"In\",Transaction!B:B,Report!A80))","v":""},{"$f":"IF(A80=\"\",\"\",SUMIFS(Transaction!F:F,Transaction!E:E,\"out\",Transaction!B:B,Report!A80))","v":""},""]
[{"$f":"IF('Item List'!A81=\"\",\"\",'Item List'!A81)","v":""},{"$f":"IF(A81=\"\",\"\",SUMIF('Item List'!A:D,Report!A81,'Item List'!D:D))","v":""},{"$f":"IF(A81=\"\",\"\",SUMIFS(Transaction!F:F,Transaction!E:E,\"In\",Transaction!B:B,Report!A81))","v":""},{"$f":"IF(A81=\"\",\"\",SUMIFS(Transaction!F:F,Transaction!E:E,\"out\",Transaction!B:B,Report!A81))","v":""},""]
[{"$f":"IF('Item List'!A82=\"\",\"\",'Item List'!A82)","v":""},{"$f":"IF(A82=\"\",\"\",SUMIF('Item List'!A:D,Report!A82,'Item List'!D:D))","v":""},{"$f":"IF(A82=\"\",\"\",SUMIFS(Transaction!F:F,Transaction!E:E,\"In\",Transaction!B:B,Report!A82))","v":""},{"$f":"IF(A82=\"\",\"\",SUMIFS(Transaction!F:F,Transaction!E:E,\"out\",Transaction!B:B,Report!A82))","v":""},""]
[{"$f":"IF('Item List'!A83=\"\",\"\",'Item List'!A83)","v":""},{"$f":"IF(A83=\"\",\"\",SUMIF('Item List'!A:D,Report!A83,'Item List'!D:D))","v":""},{"$f":"IF(A83=\"\",\"\",SUMIFS(Transaction!F:F,Transaction!E:E,\"In\",Transaction!B:B,Report!A83))","v":""},{"$f":"IF(A83=\"\",\"\",SUMIFS(Transaction!F:F,Transaction!E:E,\"out\",Transaction!B:B,Report!A83))","v":""},""]
[{"$f":"IF('Item List'!A84=\"\",\"\",'Item List'!A84)","v":""},{"$f":"IF(A84=\"\",\"\",SUMIF('Item List'!A:D,Report!A84,'Item List'!D:D))","v":""},{"$f":"IF(A84=\"\",\"\",SUMIFS(Transaction!F:F,Transaction!E:E,\"In\",Transaction!B:B,Report!A84))","v":""},{"$f":"IF(A84=\"\",\"\",SUMIFS(Transaction!F:F,Transaction!E:E,\"out\",Transaction!B:B,Report!A84))","v":""},""]
[{"$f":"IF('Item List'!A85=\"\",\"\",'Item List'!A85)","v":""},{"$f":"IF(A85=\"\",\"\",SUMIF('Item List'!A:D,Report!A85,'Item List'!D:D))","v":""},{"$f":"IF(A85=\"\",\"\",SUMIFS(Transaction!F:F,Transaction!E:E,\"In\",Transaction!B:B,Report!A85))","v":""},{"$f":"IF(A85=\"\",\"\",SUMIFS(Transaction!F:F,Transaction!E:E,\"out\",Transaction!B:B,Report!A85))","v":""},""]
[{"$f":"IF('Item List'!A86=\"\",\"\",'Item List'!A86)","v":""},{"$f":"IF(A86=\"\",\"\",SUMIF('Item List'!A:D,Report!A86,'Item List'!D:D))","v":""},{"$f":"IF(A86=\"\",\"\",SUMIFS(Transaction!F:F,Transaction!E:E,\"In\",Transaction!B:B,Report!A86))","v":""},{"$f":"IF(A86=\"\",\"\",SUMIFS(Transaction!F:F,Transaction!E:E,\"out\",Transaction!B:B,Report!A86))","v":""},""]
[{"$f":"IF('Item List'!A87=\"\",\"\",'Item List'!A87)","v":""},{"$f":"IF(A87=\"\",\"\",SUMIF('Item List'!A:D,Report!A87,'Item List'!D:D))","v":""},{"$f":"IF(A87=\"\",\"\",SUMIFS(Transaction!F:F,Transaction!E:E,\"In\",Transaction!B:B,Report!A87))","v":""},{"$f":"IF(A87=\"\",\"\",SUMIFS(Transaction!F:F,Transaction!E:E,\"out\",Transaction!B:B,Report!A87))","v":""},""]
[{"$f":"IF('Item List'!A88=\"\",\"\",'Item List'!A88)","v":""},{"$f":"IF(A88=\"\",\"\",SUMIF('Item List'!A:D,Report!A88,'Item List'!D:D))","v":""},{"$f":"IF(A88=\"\",\"\",SUMIFS(Transaction!F:F,Transaction!E:E,\"In\",Transaction!B:B,Report!A88))","v":""},{"$f":"IF(A88=\"\",\"\",SUMIFS(Transaction!F:F,Transaction!E:E,\"out\",Transaction!B:B,Report!A88))","v":""},""]
[{"$f":"IF('Item List'!A89=\"\",\"\",'Item List'!A89)","v":""},{"$f":"IF(A89=\"\",\"\",SUMIF('Item List'!A:D,Report!A89,'Item List'!D:D))","v":""},{"$f":"IF(A89=\"\",\"\",SUMIFS(Transaction!F:F,Transaction!E:E,\"In\",Transaction!B:B,Report!A89))","v":""},{"$f":"IF(A89=\"\",\"\",SUMIFS(Transaction!F:F,Transaction!E:E,\"out\",Transaction!B:B,Report!A89))","v":""},""]
[{"$f":"IF('Item List'!A90=\"\",\"\",'Item List'!A90)","v":""},{"$f":"IF(A90=\"\",\"\",SUMIF('Item List'!A:D,Report!A90,'Item List'!D:D))","v":""},{"$f":"IF(A90=\"\",\"\",SUMIFS(Transaction!F:F,Transaction!E:E,\"In\",Transaction!B:B,Report!A90))","v":""},{"$f":"IF(A90=\"\",\"\",SUMIFS(Transaction!F:F,Transaction!E:E,\"out\",Transaction!B:B,Report!A90))","v":""},""]
[{"$f":"IF('Item List'!A91=\"\",\"\",'Item List'!A91)","v":""},{"$f":"IF(A91=\"\",\"\",SUMIF('Item List'!A:D,Report!A91,'Item List'!D:D))","v":""},{"$f":"IF(A91=\"\",\"\",SUMIFS(Transaction!F:F,Transaction!E:E,\"In\",Transaction!B:B,Report!A91))","v":""},{"$f":"IF(A91=\"\",\"\",SUMIFS(Transaction!F:F,Transaction!E:E,\"out\",Transaction!B:B,Report!A91))","v":""},""]
[{"$f":"IF('Item List'!A92=\"\",\"\",'Item List'!A92)","v":""},{"$f":"IF(A92=\"\",\"\",SUMIF('Item List'!A:D,Report!A92,'Item List'!D:D))","v":""},{"$f":"IF(A92=\"\",\"\",SUMIFS(Transaction!F:F,Transaction!E:E,\"In\",Transaction!B:B,Report!A92))","v":""},{"$f":"IF(A92=\"\",\"\",SUMIFS(Transaction!F:F,Transaction!E:E,\"out\",Transaction!B:B,Report!A92))","v":""},""]
[{"$f":"IF('Item List'!A93=\"\",\"\",'Item List'!A93)","v":""},{"$f":"IF(A93=\"\",\"\",SUMIF('Item List'!A:D,Report!A93,'Item List'!D:D))","v":""},{"$f":"IF(A93=\"\",\"\",SUMIFS(Transaction!F:F,Transaction!E:E,\"In\",Transaction!B:B,Report!A93))","v":""},{"$f":"IF(A93=\"\",\"\",SUMIFS(Transaction!F:F,Transaction!E:E,\"out\",Transaction!B:B,Report!A93))","v":""},""]
[{"$f":"IF('Item List'!A94=\"\",\"\",'Item List'!A94)","v":""},{"$f":"IF(A94=\"\",\"\",SUMIF('Item List'!A:D,Report!A94,'Item List'!D:D))","v":""},{"$f":"IF(A94=\"\",\"\",SUMIFS(Transaction!F:F,Transaction!E:E,\"In\",Transaction!B:B,Report!A94))","v":""},{"$f":"IF(A94=\"\",\"\",SUMIFS(Transaction!F:F,Transaction!E:E,\"out\",Transaction!B:B,Report!A94))","v":""},""]
[{"$f":"IF('Item List'!A95=\"\",\"\",'Item List'!A95)","v":""},{"$f":"IF(A95=\"\",\"\",SUMIF('Item List'!A:D,Report!A95,'Item List'!D:D))","v":""},{"$f":"IF(A95=\"\",\"\",SUMIFS(Transaction!F:F,Transaction!E:E,\"In\",Transaction!B:B,Report!A95))","v":""},{"$f":"IF(A95=\"\",\"\",SUMIFS(Transaction!F:F,Transaction!E:E,\"out\",Transaction!B:B,Report!A95))","v":""},""]
[{"$f":"IF('Item List'!A96=\"\",\"\",'Item List'!A96)","v":""},{"$f":"IF(A96=\"\",\"\",SUMIF('Item List'!A:D,Report!A96,'Item List'!D:D))","v":""},{"$f":"IF(A96=\"\",\"\",SUMIFS(Transaction!F:F,Transaction!E:E,\"In\",Transaction!B:B,Report!A96))","v":""},{"$f":"IF(A96=\"\",\"\",SUMIFS(Transaction!F:F,Transaction!E:E,\"out\",Transaction!B:B,Report!A96))","v":""},""]
[{"$f":"IF('Item List'!A97=\"\",\"\",'Item List'!A97)","v":""},{"$f":"IF(A97=\"\",\"\",SUMIF('Item List'!A:D,Report!A97,'Item List'!D:D))","v":""},{"$f":"IF(A97=\"\",\"\",SUMIFS(Transaction!F:F,Transaction!E:E,\"In\",Transaction!B:B,Report!A97))","v":""},{"$f":"IF(A97=\"\",\"\",SUMIFS(Transaction!F:F,Transaction!E:E,\"out\",Transaction!B:B,Report!A97))","v":""},""]
[{"$f":"IF('Item List'!A98=\"\",\"\",'Item List'!A98)","v":""},{"$f":"IF(A98=\"\",\"\",SUMIF('Item List'!A:D,Report!A98,'Item List'!D:D))","v":""},{"$f":"IF(A98=\"\",\"\",SUMIFS(Transaction!F:F,Transaction!E:E,\"In\",Transaction!B:B,Report!A98))","v":""},{"$f":"IF(A98=\"\",\"\",SUMIFS(Transaction!F:F,Transaction!E:E,\"out\",Transaction!B:B,Report!A98))","v":""},""]
[{"$f":"IF('Item List'!A99=\"\",\"\",'Item List'!A99)","v":""},{"$f":"IF(A99=\"\",\"\",SUMIF('Item List'!A:D,Report!A99,'Item List'!D:D))","v":""},{"$f":"IF(A99=\"\",\"\",SUMIFS(Transaction!F:F,Transaction!E:E,\"In\",Transaction!B:B,Report!A99))","v":""},{"$f":"IF(A99=\"\",\"\",SUMIFS(Transaction!F:F,Transaction!E:E,\"out\",Transaction!B:B,Report!A99))","v":""},""]
[{"$f":"IF('Item List'!A100=\"\",\"\",'Item List'!A100)","v":""},{"$f":"IF(A100=\"\",\"\",SUMIF('Item List'!A:D,Report!A100,'Item List'!D:D))","v":""},{"$f":"IF(A100=\"\",\"\",SUMIFS(Transaction!F:F,Transaction!E:E,\"In\",Transaction!B:B,Report!A100))","v":""},{"$f":"IF(A100=\"\",\"\",SUMIFS(Transaction!F:F,Transaction!E:E,\"out\",Transaction!B:B,Report!A100))","v":""},""]
[{"$f":"IF('Item List'!A101=\"\",\"\",'Item List'!A101)","v":""},{"$f":"IF(A101=\"\",\"\",SUMIF('Item List'!A:D,Report!A101,'Item List'!D:D))","v":""},{"$f":"IF(A101=\"\",\"\",SUMIFS(Transaction!F:F,Transaction!E:E,\"In\",Transaction!B:B,Report!A101))","v":""},{"$f":"IF(A101=\"\",\"\",SUMIFS(Transaction!F:F,Transaction!E:E,\"out\",Transaction!B:B,Report!A101))","v":""},""]
[{"$f":"IF('Item List'!A102=\"\",\"\",'Item List'!A102)","v":""},{"$f":"IF(A102=\"\",\"\",SUMIF('Item List'!A:D,Report!A102,'Item List'!D:D))","v":""},{"$f":"IF(A102=\"\",\"\",SUMIFS(Transaction!F:F,Transaction!E:E,\"In\",Transaction!B:B,Report!A102))","v":""},{"$f":"IF(A102=\"\",\"\",SUMIFS(Transaction!F:F,Transaction!E:E,\"out\",Transaction!B:B,Report!A102))","v":""},""]
[{"$f":"IF('Item List'!A103=\"\",\"\",'Item List'!A103)","v":""},{"$f":"IF(A103=\"\",\"\",SUMIF('Item List'!A:D,Report!A103,'Item List'!D:D))","v":""},{"$f":"IF(A103=\"\",\"\",SUMIFS(Transaction!F:F,Transaction!E:E,\"In\",Transaction!B:B,Report!A103))","v":""},{"$f":"IF(A103=\"\",\"\",SUMIFS(Transaction!F:F,Transaction!E:E,\"out\",Transaction!B:B,Report!A103))","v":""},""]
[{"$f":"IF('Item List'!A104=\"\",\"\",'Item List'!A104)","v":""},{"$f":"IF(A104=\"\",\"\",SUMIF('Item List'!A:D,Report!A104,'Item List'!D:D))","v":""},{"$f":"IF(A104=\"\",\"\",SUMIFS(Transaction!F:F,Transaction!E:E,\"In\",Transaction!B:B,Report!A104))","v":""},{"$f":"IF(A104=\"\",\"\",SUMIFS(Transaction!F:F,Transaction!E:E,\"out\",Transaction!B:B,Report!A104))","v":""},""]
[{"$f":"IF('Item List'!A105=\"\",\"\",'Item List'!A105)","v":""},{"$f":"IF(A105=\"\",\"\",SUMIF('Item List'!A:D,Report!A105,'Item List'!D:D))","v":""},{"$f":"IF(A105=\"\",\"\",SUMIFS(Transaction!F:F,Transaction!E:E,\"In\",Transaction!B:B,Report!A105))","v":""},{"$f":"IF(A105=\"\",\"\",SUMIFS(Transaction!F:F,Transaction!E:E,\"out\",Transaction!B:B,Report!A105))","v":""},""]
[{"$f":"IF('Item List'!A106=\"\",\"\",'Item List'!A106)","v":""},{"$f":"IF(A106=\"\",\"\",SUMIF('Item List'!A:D,Report!A106,'Item List'!D:D))","v":""},{"$f":"IF(A106=\"\",\"\",SUMIFS(Transaction!F:F,Transaction!E:E,\"In\",Transaction!B:B,Report!A106))","v":""},{"$f":"IF(A106=\"\",\"\",SUMIFS(Transaction!F:F,Transaction!E:E,\"out\",Transaction!B:B,Report!A106))","v":""},""]
[{"$f":"IF('Item List'!A107=\"\",\"\",'Item List'!A107)","v":""},{"$f":"IF(A107=\"\",\"\",SUMIF('Item List'!A:D,Report!A107,'Item List'!D:D))","v":""},{"$f":"IF(A107=\"\",\"\",SUMIFS(Transaction!F:F,Transaction!E:E,\"In\",Transaction!B:B,Report!A107))","v":""},{"$f":"IF(A107=\"\",\"\",SUMIFS(Transaction!F:F,Transaction!E:E,\"out\",Transaction!B:B,Report!A107))","v":""},""]
[{"$f":"IF('Item List'!A108=\"\",\"\",'Item List'!A108)","v":""},{"$f":"IF(A108=\"\",\"\",SUMIF('Item List'!A:D,Report!A108,'Item List'!D:D))","v":""},{"$f":"IF(A108=\"\",\"\",SUMIFS(Transaction!F:F,Transaction!E:E,\"In\",Transaction!B:B,Report!A108))","v":""},{"$f":"IF(A108=\"\",\"\",SUMIFS(Transaction!F:F,Transaction!E:E,\"out\",Transaction!B:B,Report!A108))","v":""},""]
[{"$f":"IF('Item List'!A109=\"\",\"\",'Item List'!A109)","v":""},{"$f":"IF(A109=\"\",\"\",SUMIF('Item List'!A:D,Report!A109,'Item List'!D:D))","v":""},{"$f":"IF(A109=\"\",\"\",SUMIFS(Transaction!F:F,Transaction!E:E,\"In\",Transaction!B:B,Report!A109))","v":""},{"$f":"IF(A109=\"\",\"\",SUMIFS(Transaction!F:F,Transaction!E:E,\"out\",Transaction!B:B,Report!A109))","v":""},""]
[{"$f":"IF('Item List'!A110=\"\",\"\",'Item List'!A110)","v":""},{"$f":"IF(A110=\"\",\"\",SUMIF('Item List'!A:D,Report!A110,'Item List'!D:D))","v":""},{"$f":"IF(A110=\"\",\"\",SUMIFS(Transaction!F:F,Transaction!E:E,\"In\",Transaction!B:B,Report!A110))","v":""},{"$f":"IF(A110=\"\",\"\",SUMIFS(Transaction!F:F,Transaction!E:E,\"out\",Transaction!B:B,Report!A110))","v":""},""]
[{"$f":"IF('Item List'!A111=\"\",\"\",'Item List'!A111)","v":""},{"$f":"IF(A111=\"\",\"\",SUMIF('Item List'!A:D,Report!A111,'Item List'!D:D))","v":""},{"$f":"IF(A111=\"\",\"\",SUMIFS(Transaction!F:F,Transaction!E:E,\"In\",Transaction!B:B,Report!A111))","v":""},{"$f":"IF(A111=\"\",\"\",SUMIFS(Transaction!F:F,Transaction!E:E,\"out\",Transaction!B:B,Report!A111))","v":""},""]
[{"$f":"IF('Item List'!A112=\"\",\"\",'Item List'!A112)","v":""},{"$f":"IF(A112=\"\",\"\",SUMIF('Item List'!A:D,Report!A112,'Item List'!D:D))","v":""},{"$f":"IF(A112=\"\",\"\",SUMIFS(Transaction!F:F,Transaction!E:E,\"In\",Transaction!B:B,Report!A112))","v":""},{"$f":"IF(A112=\"\",\"\",SUMIFS(Transaction!F:F,Transaction!E:E,\"out\",Transaction!B:B,Report!A112))","v":""},""]
[{"$f":"IF('Item List'!A113=\"\",\"\",'Item List'!A113)","v":""},{"$f":"IF(A113=\"\",\"\",SUMIF('Item List'!A:D,Report!A113,'Item List'!D:D))","v":""},{"$f":"IF(A113=\"\",\"\",SUMIFS(Transaction!F:F,Transaction!E:E,\"In\",Transaction!B:B,Report!A113))","v":""},{"$f":"IF(A113=\"\",\"\",SUMIFS(Transaction!F:F,Transaction!E:E,\"out\",Transaction!B:B,Report!A113))","v":""},""]
[{"$f":"IF('Item List'!A114=\"\",\"\",'Item List'!A114)","v":""},{"$f":"IF(A114=\"\",\"\",SUMIF('Item List'!A:D,Report!A114,'Item List'!D:D))","v":""},{"$f":"IF(A114=\"\",\"\",SUMIFS(Transaction!F:F,Transaction!E:E,\"In\",Transaction!B:B,Report!A114))","v":""},{"$f":"IF(A114=\"\",\"\",SUMIFS(Transaction!F:F,Transaction!E:E,\"out\",Transaction!B:B,Report!A114))","v":""},""]
[{"$f":"IF('Item List'!A115=\"\",\"\",'Item List'!A115)","v":""},{"$f":"IF(A115=\"\",\"\",SUMIF('Item List'!A:D,Report!A115,'Item List'!D:D))","v":""},{"$f":"IF(A115=\"\",\"\",SUMIFS(Transaction!F:F,Transaction!E:E,\"In\",Transaction!B:B,Report!A115))","v":""},{"$f":"IF(A115=\"\",\"\",SUMIFS(Transaction!F:F,Transaction!E:E,\"out\",Transaction!B:B,Report!A115))","v":""},""]
[{"$f":"IF('Item List'!A116=\"\",\"\",'Item List'!A116)","v":""},{"$f":"IF(A116=\"\",\"\",SUMIF('Item List'!A:D,Report!A116,'Item List'!D:D))","v":""},{"$f":"IF(A116=\"\",\"\",SUMIFS(Transaction!F:F,Transaction!E:E,\"In\",Transaction!B:B,Report!A116))","v":""},{"$f":"IF(A116=\"\",\"\",SUMIFS(Transaction!F:F,Transaction!E:E,\"out\",Transaction!B:B,Report!A116))","v":""},""]
[{"$f":"IF('Item List'!A117=\"\",\"\",'Item List'!A117)","v":""},{"$f":"IF(A117=\"\",\"\",SUMIF('Item List'!A:D,Report!A117,'Item List'!D:D))","v":""},{"$f":"IF(A117=\"\",\"\",SUMIFS(Transaction!F:F,Transaction!E:E,\"In\",Transaction!B:B,Report!A117))","v":""},{"$f":"IF(A117=\"\",\"\",SUMIFS(Transaction!F:F,Transaction!E:E,\"out\",Transaction!B:B,Report!A117))","v":""},""]
[{"$f":"IF('Item List'!A118=\"\",\"\",'Item List'!A118)","v":""},{"$f":"IF(A118=\"\",\"\",SUMIF('Item List'!A:D,Report!A118,'Item List'!D:D))","v":""},{"$f":"IF(A118=\"\",\"\",SUMIFS(Transaction!F:F,Transaction!E:E,\"In\",Transaction!B:B,Report!A118))","v":""},{"$f":"IF(A118=\"\",\"\",SUMIFS(Transaction!F:F,Transaction!E:E,\"out\",Transaction!B:B,Report!A118))","v":""},""]
[{"$f":"IF('Item List'!A119=\"\",\"\",'Item List'!A119)","v":""},{"$f":"IF(A119=\"\",\"\",SUMIF('Item List'!A:D,Report!A119,'Item List'!D:D))","v":""},{"$f":"IF(A119=\"\",\"\",SUMIFS(Transaction!F:F,Transaction!E:E,\"In\",Transaction!B:B,Report!A119))","v":""},{"$f":"IF(A119=\"\",\"\",SUMIFS(Transaction!F:F,Transaction!E:E,\"out\",Transaction!B:B,Report!A119))","v":""},""]
[{"$f":"IF('Item List'!A120=\"\",\"\",'Item List'!A120)","v":""},{"$f":"IF(A120=\"\",\"\",SUMIF('Item List'!A:D,Report!A120,'Item List'!D:D))","v":""},{"$f":"IF(A120=\"\",\"\",SUMIFS(Transaction!F:F,Transaction!E:E,\"In\",Transaction!B:B,Report!A120))","v":""},{"$f":"IF(A120=\"\",\"\",SUMIFS(Transaction!F:F,Transaction!E:E,\"out\",Transaction!B:B,Report!A120))","v":""},""]
[{"$f":"IF('Item List'!A121=\"\",\"\",'Item List'!A121)","v":""},{"$f":"IF(A121=\"\",\"\",SUMIF('Item List'!A:D,Report!A121,'Item List'!D:D))","v":""},{"$f":"IF(A121=\"\",\"\",SUMIFS(Transaction!F:F,Transaction!E:E,\"In\",Transaction!B:B,Report!A121))","v":""},{"$f":"IF(A121=\"\",\"\",SUMIFS(Transaction!F:F,Transaction!E:E,\"out\",Transaction!B:B,Report!A121))","v":""},""]
[{"$f":"IF('Item List'!A122=\"\",\"\",'Item List'!A122)","v":""},{"$f":"IF(A122=\"\",\"\",SUMIF('Item List'!A:D,Report!A122,'Item List'!D:D))","v":""},{"$f":"IF(A122=\"\",\"\",SUMIFS(Transaction!F:F,Transaction!E:E,\"In\",Transaction!B:B,Report!A122))","v":""},{"$f":"IF(A122=\"\",\"\",SUMIFS(Transaction!F:F,Transaction!E:E,\"out\",Transaction!B:B,Report!A122))","v":""},""]
[{"$f":"IF('Item List'!A123=\"\",\"\",'Item List'!A123)","v":""},{"$f":"IF(A123=\"\",\"\",SUMIF('Item List'!A:D,Report!A123,'Item List'!D:D))","v":""},{"$f":"IF(A123=\"\",\"\",SUMIFS(Transaction!F:F,Transaction!E:E,\"In\",Transaction!B:B,Report!A123))","v":""},{"$f":"IF(A123=\"\",\"\",SUMIFS(Transaction!F:F,Transaction!E:E,\"out\",Transaction!B:B,Report!A123))","v":""},""]
[{"$f":"IF('Item List'!A124=\"\",\"\",'Item List'!A124)","v":""},{"$f":"IF(A124=\"\",\"\",SUMIF('Item List'!A:D,Report!A124,'Item List'!D:D))","v":""},{"$f":"IF(A124=\"\",\"\",SUMIFS(Transaction!F:F,Transaction!E:E,\"In\",Transaction!B:B,Report!A124))","v":""},{"$f":"IF(A124=\"\",\"\",SUMIFS(Transaction!F:F,Transaction!E:E,\"out\",Transaction!B:B,Report!A124))","v":""},""]
[{"$f":"IF('Item List'!A125=\"\",\"\",'Item List'!A125)","v":""},{"$f":"IF(A125=\"\",\"\",SUMIF('Item List'!A:D,Report!A125,'Item List'!D:D))","v":""},{"$f":"IF(A125=\"\",\"\",SUMIFS(Transaction!F:F,Transaction!E:E,\"In\",Transaction!B:B,Report!A125))","v":""},{"$f":"IF(A125=\"\",\"\",SUMIFS(Transaction!F:F,Transaction!E:E,\"out\",Transaction!B:B,Report!A125))","v":""},""]
[{"$f":"IF('Item List'!A126=\"\",\"\",'Item List'!A126)","v":""},{"$f":"IF(A126=\"\",\"\",SUMIF('Item List'!A:D,Report!A126,'Item List'!D:D))","v":""},{"$f":"IF(A126=\"\",\"\",SUMIFS(Transaction!F:F,Transaction!E:E,\"In\",Transaction!B:B,Report!A126))","v":""},{"$f":"IF(A126=\"\",\"\",SUMIFS(Transaction!F:F,Transaction!E:E,\"out\",Transaction!B:B,Report!A126))","v":""},""]
[{"$f":"IF('Item List'!A127=\"\",\"\",'Item List'!A127)","v":""},{"$f":"IF(A127=\"\",\"\",SUMIF('Item List'!A:D,Report!A127,'Item List'!D:D))","v":""},{"$f":"IF(A127=\"\",\"\",SUMIFS(Transaction!F:F,Transaction!E:E,\"In\",Transaction!B:B,Report!A127))","v":""},{"$f":"IF(A127=\"\",\"\",SUMIFS(Transaction!F:F,Transaction!E:E,\"out\",Transaction!B:B,Report!A127))","v":""},""]
[{"$f":"IF('Item List'!A128=\"\",\"\",'Item List'!A128)","v":""},{"$f":"IF(A128=\"\",\"\",SUMIF('Item List'!A:D,Report!A128,'Item List'!D:D))","v":""},{"$f":"IF(A128=\"\",\"\",SUMIFS(Transaction!F:F,Transaction!E:E,\"In\",Transaction!B:B,Report!A128))","v":""},{"$f":"IF(A128=\"\",\"\",SUMIFS(Transaction!F:F,Transaction!E:E,\"out\",Transaction!B:B,Report!A128))","v":""},""]
[{"$f":"IF('Item List'!A129=\"\",\"\",'Item List'!A129)","v":""},{"$f":"IF(A129=\"\",\"\",SUMIF('Item List'!A:D,Report!A129,'Item List'!D:D))","v":""},{"$f":"IF(A129=\"\",\"\",SUMIFS(Transaction!F:F,Transaction!E:E,\"In\",Transaction!B:B,Report!A129))","v":""},{"$f":"IF(A129=\"\",\"\",SUMIFS(Transaction!F:F,Transaction!E:E,\"out\",Transaction!B:B,Report!A129))","v":""},""]
[{"$f":"IF('Item List'!A130=\"\",\"\",'Item List'!A130)","v":""},{"$f":"IF(A130=\"\",\"\",SUMIF('Item List'!A:D,Report!A130,'Item List'!D:D))","v":""},{"$f":"IF(A130=\"\",\"\",SUMIFS(Transaction!F:F,Transaction!E:E,\"In\",Transaction!B:B,Report!A130))","v":""},{"$f":"IF(A130=\"\",\"\",SUMIFS(Transaction!F:F,Transaction!E:E,\"out\",Transaction!B:B,Report!A130))","v":""},""]
[{"$f":"IF('Item List'!A131=\"\",\"\",'Item List'!A131)","v":""},{"$f":"IF(A131=\"\",\"\",SUMIF('Item List'!A:D,Report!A131,'Item List'!D:D))","v":""},{"$f":"IF(A131=\"\",\"\",SUMIFS(Transaction!F:F,Transaction!E:E,\"In\",Transaction!B:B,Report!A131))","v":""},{"$f":"IF(A131=\"\",\"\",SUMIFS(Transaction!F:F,Transaction!E:E,\"out\",Transaction!B:B,Report!A131))","v":""},{"$f":"IF(A131=\"\",\"\",B131+C131-D131)","v":""}]
[{"$f":"IF('Item List'!A132=\"\",\"\",'Item List'!A132)","v":""},{"$f":"IF(A132=\"\",\"\",SUMIF('Item List'!A:D,Report!A132,'Item List'!D:D))","v":""},{"$f":"IF(A132=\"\",\"\",SUMIFS(Transaction!F:F,Transaction!E:E,\"In\",Transaction!B:B,Report!A132))","v":""},{"$f":"IF(A132=\"\",\"\",SUMIFS(Transaction!F:F,Transaction!E:E,\"out\",Transaction!B:B,Report!A132))","v":""},""]
[{"$f":"IF('Item List'!A133=\"\",\"\",'Item List'!A133)","v":""},{"$f":"IF(A133=\"\",\"\",SUMIF('Item List'!A:D,Report!A133,'Item List'!D:D))","v":""},{"$f":"IF(A133=\"\",\"\",SUMIFS(Transaction!F:F,Transaction!E:E,\"In\",Transaction!B:B,Report!A133))","v":""},{"$f":"IF(A133=\"\",\"\",SUMIFS(Transaction!F:F,Transaction!E:E,\"out\",Transaction!B:B,Report!A133))","v":""},""]
[{"$f":"IF('Item List'!A134=\"\",\"\",'Item List'!A134)","v":""},{"$f":"IF(A134=\"\",\"\",SUMIF('Item List'!A:D,Report!A134,'Item List'!D:D))","v":""},{"$f":"IF(A134=\"\",\"\",SUMIFS(Transaction!F:F,Transaction!E:E,\"In\",Transaction!B:B,Report!A134))","v":""},{"$f":"IF(A134=\"\",\"\",SUMIFS(Transaction!F:F,Transaction!E:E,\"out\",Transaction!B:B,Report!A134))","v":""},""]
[{"$f":"IF('Item List'!A135=\"\",\"\",'Item List'!A135)","v":""},{"$f":"IF(A135=\"\",\"\",SUMIF('Item List'!A:D,Report!A135,'Item List'!D:D))","v":""},{"$f":"IF(A135=\"\",\"\",SUMIFS(Transaction!F:F,Transaction!E:E,\"In\",Transaction!B:B,Report!A135))","v":""},{"$f":"IF(A135=\"\",\"\",SUMIFS(Transaction!F:F,Transaction!E:E,\"out\",Transaction!B:B,Report!A135))","v":""},""]
[{"$f":"IF('Item List'!A136=\"\",\"\",'Item List'!A136)","v":""},{"$f":"IF(A136=\"\",\"\",SUMIF('Item List'!A:D,Report!A136,'Item List'!D:D))","v":""},{"$f":"IF(A136=\"\",\"\",SUMIFS(Transaction!F:F,Transaction!E:E,\"In\",Transaction!B:B,Report!A136))","v":""},{"$f":"IF(A136=\"\",\"\",SUMIFS(Transaction!F:F,Transaction!E:E,\"out\",Transaction!B:B,Report!A136))","v":""},""]
[{"$f":"IF('Item List'!A137=\"\",\"\",'Item List'!A137)","v":""},{"$f":"IF(A137=\"\",\"\",SUMIF('Item List'!A:D,Report!A137,'Item List'!D:D))","v":""},{"$f":"IF(A137=\"\",\"\",SUMIFS(Transaction!F:F,Transaction!E:E,\"In\",Transaction!B:B,Report!A137))","v":""},{"$f":"IF(A137=\"\",\"\",SUMIFS(Transaction!F:F,Transaction!E:E,\"out\",Transaction!B:B,Report!A137))","v":""},""]
[{"$f":"IF('Item List'!A138=\"\",\"\",'Item List'!A138)","v":""},{"$f":"IF(A138=\"\",\"\",SUMIF('Item List'!A:D,Report!A138,'Item List'!D:D))","v":""},{"$f":"IF(A138=\"\",\"\",SUMIFS(Transaction!F:F,Transaction!E:E,\"In\",Transaction!B:B,Report!A138))","v":""},{"$f":"IF(A138=\"\",\"\",SUMIFS(Transaction!F:F,Transaction!E:E,\"out\",Transaction!B:B,Report!A138))","v":""},""]
[{"$f":"IF('Item List'!A139=\"\",\"\",'Item List'!A139)","v":""},{"$f":"IF(A139=\"\",\"\",SUMIF('Item List'!A:D,Report!A139,'Item List'!D:D))","v":""},{"$f":"IF(A139=\"\",\"\",SUMIFS(Transaction!F:F,Transaction!E:E,\"In\",Transaction!B:B,Report!A139))","v":""},{"$f":"IF(A139=\"\",\"\",SUMIFS(Transaction!F:F,Transaction!E:E,\"out\",Transaction!B:B,Report!A139))","v":""},""]
[{"$f":"IF('Item List'!A140=\"\",\"\",'Item List'!A140)","v":""},{"$f":"IF(A140=\"\",\"\",SUMIF('Item List'!A:D,Report!A140,'Item List'!D:D))","v":""},{"$f":"IF(A140=\"\",\"\",SUMIFS(Transaction!F:F,Transaction!E:E,\"In\",Transaction!B:B,Report!A140))","v":""},{"$f":"IF(A140=\"\",\"\",SUMIFS(Transaction!F:F,Transaction!E:E,\"out\",Transaction!B:B,Report!A140))","v":""},""]
[{"$f":"IF('Item List'!A141=\"\",\"\",'Item List'!A141)","v":""},{"$f":"IF(A141=\"\",\"\",SUMIF('Item List'!A:D,Report!A141,'Item List'!D:D))","v":""},{"$f":"IF(A141=\"\",\"\",SUMIFS(Transaction!F:F,Transaction!E:E,\"In\",Transaction!B:B,Report!A141))","v":""},{"$f":"IF(A141=\"\",\"\",SUMIFS(Transaction!F:F,Transaction!E:E,\"out\",Transaction!B:B,Report!A141))","v":""},""]
[{"$f":"IF('Item List'!A142=\"\",\"\",'Item List'!A142)","v":""},{"$f":"IF(A142=\"\",\"\",SUMIF('Item List'!A:D,Report!A142,'Item List'!D:D))","v":""},{"$f":"IF(A142=\"\",\"\",SUMIFS(Transaction!F:F,Transaction!E:E,\"In\",Transaction!B:B,Report!A142))","v":""},{"$f":"IF(A142=\"\",\"\",SUMIFS(Transaction!F:F,Transaction!E:E,\"out\",Transaction!B:B,Report!A142))","v":""},""]
[{"$f":"IF('Item List'!A143=\"\",\"\",'Item List'!A143)","v":""},{"$f":"IF(A143=\"\",\"\",SUMIF('Item List'!A:D,Report!A143,'Item List'!D:D))","v":""},{"$f":"IF(A143=\"\",\"\",SUMIFS(Transaction!F:F,Transaction!E:E,\"In\",Transaction!B:B,Report!A143))","v":""},{"$f":"IF(A143=\"\",\"\",SUMIFS(Transaction!F:F,Transaction!E:E,\"out\",Transaction!B:B,Report!A143))","v":""},""]
[{"$f":"IF('Item List'!A144=\"\",\"\",'Item List'!A144)","v":""},{"$f":"IF(A144=\"\",\"\",SUMIF('Item List'!A:D,Report!A144,'Item List'!D:D))","v":""},{"$f":"IF(A144=\"\",\"\",SUMIFS(Transaction!F:F,Transaction!E:E,\"In\",Transaction!B:B,Report!A144))","v":""},{"$f":"IF(A144=\"\",\"\",SUMIFS(Transaction!F:F,Transaction!E:E,\"out\",Transaction!B:B,Report!A144))","v":""},""]
[{"$f":"IF('Item List'!A145=\"\",\"\",'Item List'!A145)","v":""},{"$f":"IF(A145=\"\",\"\",SUMIF('Item List'!A:D,Report!A145,'Item List'!D:D))","v":""},{"$f":"IF(A145=\"\",\"\",SUMIFS(Transaction!F:F,Transaction!E:E,\"In\",Transaction!B:B,Report!A145))","v":""},{"$f":"IF(A145=\"\",\"\",SUMIFS(Transaction!F:F,Transaction!E:E,\"out\",Transaction!B:B,Report!A145))","v":""},""]
[{"$f":"IF('Item List'!A146=\"\",\"\",'Item List'!A146)","v":""},{"$f":"IF(A146=\"\",\"\",SUMIF('Item List'!A:D,Report!A146,'Item List'!D:D))","v":""},{"$f":"IF(A146=\"\",\"\",SUMIFS(Transaction!F:F,Transaction!E:E,\"In\",Transaction!B:B,Report!A146))","v":""},{"$f":"IF(A146=\"\",\"\",SUMIFS(Transaction!F:F,Transaction!E:E,\"out\",Transaction!B:B,Report!A146))","v":""},""]
[{"$f":"IF('Item List'!A147=\"\",\"\",'Item List'!A147)","v":""},{"$f":"IF(A147=\"\",\"\",SUMIF('Item List'!A:D,Report!A147,'Item List'!D:D))","v":""},{"$f":"IF(A147=\"\",\"\",SUMIFS(Transaction!F:F,Transaction!E:E,\"In\",Transaction!B:B,Report!A147))","v":""},{"$f":"IF(A147=\"\",\"\",SUMIFS(Transaction!F:F,Transaction!E:E,\"out\",Transaction!B:B,Report!A147))","v":""},""]
[{"$f":"IF('Item List'!A148=\"\",\"\",'Item List'!A148)","v":""},{"$f":"IF(A148=\"\",\"\",SUMIF('Item List'!A:D,Report!A148,'Item List'!D:D))","v":""},{"$f":"IF(A148=\"\",\"\",SUMIFS(Transaction!F:F,Transaction!E:E,\"In\",Transaction!B:B,Report!A148))","v":""},{"$f":"IF(A148=\"\",\"\",SUMIFS(Transaction!F:F,Transaction!E:E,\"out\",Transaction!B:B,Report!A148))","v":""},""]
[{"$f":"IF('Item List'!A149=\"\",\"\",'Item List'!A149)","v":""},{"$f":"IF(A149=\"\",\"\",SUMIF('Item List'!A:D,Report!A149,'Item List'!D:D))","v":""},{"$f":"IF(A149=\"\",\"\",SUMIFS(Transaction!F:F,Transaction!E:E,\"In\",Transaction!B:B,Report!A149))","v":""},{"$f":"IF(A149=\"\",\"\",SUMIFS(Transaction!F:F,Transaction!E:E,\"out\",Transaction!B:B,Report!A149))","v":""},""]
[{"$f":"IF('Item List'!A150=\"\",\"\",'Item List'!A150)","v":""},{"$f":"IF(A150=\"\",\"\",SUMIF('Item List'!A:D,Report!A150,'Item List'!D:D))","v":""},{"$f":"IF(A150=\"\",\"\",SUMIFS(Transaction!F:F,Transaction!E:E,\"In\",Transaction!B:B,Report!A150))","v":""},{"$f":"IF(A150=\"\",\"\",SUMIFS(Transaction!F:F,Transaction!E:E,\"out\",Transaction!B:B,Report!A150))","v":""},""]
[{"$f":"IF('Item List'!A151=\"\",\"\",'Item List'!A151)","v":""},{"$f":"IF(A151=\"\",\"\",SUMIF('Item List'!A:D,Report!A151,'Item List'!D:D))","v":""},{"$f":"IF(A151=\"\",\"\",SUMIFS(Transaction!F:F,Transaction!E:E,\"In\",Transaction!B:B,Report!A151))","v":""},{"$f":"IF(A151=\"\",\"\",SUMIFS(Transaction!F:F,Transaction!E:E,\"out\",Transaction!B:B,Report!A151))","v":""},""]
[{"$f":"IF('Item List'!A152=\"\",\"\",'Item List'!A152)","v":""},{"$f":"IF(A152=\"\",\"\",SUMIF('Item List'!A:D,Report!A152,'Item List'!D:D))","v":""},{"$f":"IF(A152=\"\",\"\",SUMIFS(Transaction!F:F,Transaction!E:E,\"In\",Transaction!B:B,Report!A152))","v":""},{"$f":"IF(A152=\"\",\"\",SUMIFS(Transaction!F:F,Transaction!E:E,\"out\",Transaction!B:B,Report!A152))","v":""},""]
[{"$f":"IF('Item List'!A153=\"\",\"\",'Item List'!A153)","v":""},{"$f":"IF(A153=\"\",\"\",SUMIF('Item List'!A:D,Report!A153,'Item List'!D:D))","v":""},{"$f":"IF(A153=\"\",\"\",SUMIFS(Transaction!F:F,Transaction!E:E,\"In\",Transaction!B:B,Report!A153))","v":""},{"$f":"IF(A153=\"\",\"\",SUMIFS(Transaction!F:F,Transaction!E:E,\"out\",Transaction!B:B,Report!A153))","v":""},""]
[{"$f":"IF('Item List'!A154=\"\",\"\",'Item List'!A154)","v":""},{"$f":"IF(A154=\"\",\"\",SUMIF('Item List'!A:D,Report!A154,'Item List'!D:D))","v":""},{"$f":"IF(A154=\"\",\"\",SUMIFS(Transaction!F:F,Transaction!E:E,\"In\",Transaction!B:B,Report!A154))","v":""},{"$f":"IF(A154=\"\",\"\",SUMIFS(Transaction!F:F,Transaction!E:E,\"out\",Transaction!B:B,Report!A154))","v":""},""]
[{"$f":"IF('Item List'!A155=\"\",\"\",'Item List'!A155)","v":""},{"$f":"IF(A155=\"\",\"\",SUMIF('Item List'!A:D,Report!A155,'Item List'!D:D))","v":""},{"$f":"IF(A155=\"\",\"\",SUMIFS(Transaction!F:F,Transaction!E:E,\"In\",Transaction!B:B,Report!A155))","v":""},{"$f":"IF(A155=\"\",\"\",SUMIFS(Transaction!F:F,Transaction!E:E,\"out\",Transaction!B:B,Report!A155))","v":""},""]
[{"$f":"IF('Item List'!A156=\"\",\"\",'Item List'!A156)","v":""},{"$f":"IF(A156=\"\",\"\",SUMIF('Item List'!A:D,Report!A156,'Item List'!D:D))","v":""},{"$f":"IF(A156=\"\",\"\",SUMIFS(Transaction!F:F,Transaction!E:E,\"In\",Transaction!B:B,Report!A156))","v":""},{"$f":"IF(A156=\"\",\"\",SUMIFS(Transaction!F:F,Transaction!E:E,\"out\",Transaction!B:B,Report!A156))","v":""},""]
[{"$f":"IF('Item List'!A157=\"\",\"\",'Item List'!A157)","v":""},{"$f":"IF(A157=\"\",\"\",SUMIF('Item List'!A:D,Report!A157,'Item List'!D:D))","v":""},{"$f":"IF(A157=\"\",\"\",SUMIFS(Transaction!F:F,Transaction!E:E,\"In\",Transaction!B:B,Report!A157))","v":""},{"$f":"IF(A157=\"\",\"\",SUMIFS(Transaction!F:F,Transaction!E:E,\"out\",Transaction!B:B,Report!A157))","v":""},""]
[{"$f":"IF('Item List'!A158=\"\",\"\",'Item List'!A158)","v":""},{"$f":"IF(A158=\"\",\"\",SUMIF('Item List'!A:D,Report!A158,'Item List'!D:D))","v":""},{"$f":"IF(A158=\"\",\"\",SUMIFS(Transaction!F:F,Transaction!E:E,\"In\",Transaction!B:B,Report!A158))","v":""},{"$f":"IF(A158=\"\",\"\",SUMIFS(Transaction!F:F,Transaction!E:E,\"out\",Transaction!B:B,Report!A158))","v":""},""]
[{"$f":"IF('Item List'!A159=\"\",\"\",'Item List'!A159)","v":""},{"$f":"IF(A159=\"\",\"\",SUMIF('Item List'!A:D,Report!A159,'Item List'!D:D))","v":""},{"$f":"IF(A159=\"\",\"\",SUMIFS(Transaction!F:F,Transaction!E:E,\"In\",Transaction!B:B,Report!A159))","v":""},{"$f":"IF(A159=\"\",\"\",SUMIFS(Transaction!F:F,Transaction!E:E,\"out\",Transaction!B:B,Report!A159))","v":""},""]
[{"$f":"IF('Item List'!A160=\"\",\"\",'Item List'!A160)","v":""},{"$f":"IF(A160=\"\",\"\",SUMIF('Item List'!A:D,Report!A160,'Item List'!D:D))","v":""},{"$f":"IF(A160=\"\",\"\",SUMIFS(Transaction!F:F,Transaction!E:E,\"In\",Transaction!B:B,Report!A160))","v":""},{"$f":"IF(A160=\"\",\"\",SUMIFS(Transaction!F:F,Transaction!E:E,\"out\",Transaction!B:B,Report!A160))","v":""},""]
[{"$f":"IF('Item List'!A161=\"\",\"\",'Item List'!A161)","v":""},{"$f":"IF(A161=\"\",\"\",SUMIF('Item List'!A:D,Report!A161,'Item List'!D:D))","v":""},{"$f":"IF(A161=\"\",\"\",SUMIFS(Transaction!F:F,Transaction!E:E,\"In\",Transaction!B:B,Report!A161))","v":""},{"$f":"IF(A161=\"\",\"\",SUMIFS(Transaction!F:F,Transaction!E:E,\"out\",Transaction!B:B,Report!A161))","v":""},""]
[{"$f":"IF('Item List'!A162=\"\",\"\",'Item List'!A162)","v":""},{"$f":"IF(A162=\"\",\"\",SUMIF('Item List'!A:D,Report!A162,'Item List'!D:D))","v":""},{"$f":"IF(A162=\"\",\"\",SUMIFS(Transaction!F:F,Transaction!E:E,\"In\",Transaction!B:B,Report!A162))","v":""},{"$f":"IF(A162=\"\",\"\",SUMIFS(Transaction!F:F,Transaction!E:E,\"out\",Transaction!B:B,Report!A162))","v":""},""]
[{"$f":"IF('Item List'!A163=\"\",\"\",'Item List'!A163)","v":""},{"$f":"IF(A163=\"\",\"\",SUMIF('Item List'!A:D,Report!A163,'Item List'!D:D))","v":""},{"$f":"IF(A163=\"\",\"\",SUMIFS(Transaction!F:F,Transaction!E:E,\"In\",Transaction!B:B,Report!A163))","v":""},{"$f":"IF(A163=\"\",\"\",SUMIFS(Transaction!F:F,Transaction!E:E,\"out\",Transaction!B:B,Report!A163))","v":""},""]
[{"$f":"IF('Item List'!A164=\"\",\"\",'Item List'!A164)","v":""},{"$f":"IF(A164=\"\",\"\",SUMIF('Item List'!A:D,Report!A164,'Item List'!D:D))","v":""},{"$f":"IF(A164=\"\",\"\",SUMIFS(Transaction!F:F,Transaction!E:E,\"In\",Transaction!B:B,Report!A164))","v":""},{"$f":"IF(A164=\"\",\"\",SUMIFS(Transaction!F:F,Transaction!E:E,\"out\",Transaction!B:B,Report!A164))","v":""},""]
[{"$f":"IF('Item List'!A165=\"\",\"\",'Item List'!A165)","v":""},{"$f":"IF(A165=\"\",\"\",SUMIF('Item List'!A:D,Report!A165,'Item List'!D:D))","v":""},{"$f":"IF(A165=\"\",\"\",SUMIFS(Transaction!F:F,Transaction!E:E,\"In\",Transaction!B:B,Report!A165))","v":""},{"$f":"IF(A165=\"\",\"\",SUMIFS(Transaction!F:F,Transaction!E:E,\"out\",Transaction!B:B,Report!A165))","v":""},""]
[{"$f":"IF('Item List'!A166=\"\",\"\",'Item List'!A166)","v":""},{"$f":"IF(A166=\"\",\"\",SUMIF('Item List'!A:D,Report!A166,'Item List'!D:D))","v":""},{"$f":"IF(A166=\"\",\"\",SUMIFS(Transaction!F:F,Transaction!E:E,\"In\",Transaction!B:B,Report!A166))","v":""},{"$f":"IF(A166=\"\",\"\",SUMIFS(Transaction!F:F,Transaction!E:E,\"out\",Transaction!B:B,Report!A166))","v":""},""]
[{"$f":"IF('Item List'!A167=\"\",\"\",'Item List'!A167)","v":""},{"$f":"IF(A167=\"\",\"\",SUMIF('Item List'!A:D,Report!A167,'Item List'!D:D))","v":""},{"$f":"IF(A167=\"\",\"\",SUMIFS(Transaction!F:F,Transaction!E:E,\"In\",Transaction!B:B,Report!A167))","v":""},{"$f":"IF(A167=\"\",\"\",SUMIFS(Transaction!F:F,Transaction!E:E,\"out\",Transaction!B:B,Report!A167))","v":""},""]
[{"$f":"IF('Item List'!A168=\"\",\"\",'Item List'!A168)","v":""},{"$f":"IF(A168=\"\",\"\",SUMIF('Item List'!A:D,Report!A168,'Item List'!D:D))","v":""},{"$f":"IF(A168=\"\",\"\",SUMIFS(Transaction!F:F,Transaction!E:E,\"In\",Transaction!B:B,Report!A168))","v":""},{"$f":"IF(A168=\"\",\"\",SUMIFS(Transaction!F:F,Transaction!E:E,\"out\",Transaction!B:B,Report!A168))","v":""},""]
[{"$f":"IF('Item List'!A169=\"\",\"\",'Item List'!A169)","v":""},{"$f":"IF(A169=\"\",\"\",SUMIF('Item List'!A:D,Report!A169,'Item List'!D:D))","v":""},{"$f":"IF(A169=\"\",\"\",SUMIFS(Transaction!F:F,Transaction!E:E,\"In\",Transaction!B:B,Report!A169))","v":""},{"$f":"IF(A169=\"\",\"\",SUMIFS(Transaction!F:F,Transaction!E:E,\"out\",Transaction!B:B,Report!A169))","v":""},""]
[{"$f":"IF('Item List'!A170=\"\",\"\",'Item List'!A170)","v":""},{"$f":"IF(A170=\"\",\"\",SUMIF('Item List'!A:D,Report!A170,'Item List'!D:D))","v":""},{"$f":"IF(A170=\"\",\"\",SUMIFS(Transaction!F:F,Transaction!E:E,\"In\",Transaction!B:B,Report!A170))","v":""},{"$f":"IF(A170=\"\",\"\",SUMIFS(Transaction!F:F,Transaction!E:E,\"out\",Transaction!B:B,Report!A170))","v":""},""]
[{"$f":"IF('Item List'!A171=\"\",\"\",'Item List'!A171)","v":""},{"$f":"IF(A171=\"\",\"\",SUMIF('Item List'!A:D,Report!A171,'Item List'!D:D))","v":""},{"$f":"IF(A171=\"\",\"\",SUMIFS(Transaction!F:F,Transaction!E:E,\"In\",Transaction!B:B,Report!A171))","v":""},{"$f":"IF(A171=\"\",\"\",SUMIFS(Transaction!F:F,Transaction!E:E,\"out\",Transaction!B:B,Report!A171))","v":""},""]
[{"$f":"IF('Item List'!A172=\"\",\"\",'Item List'!A172)","v":""},{"$f":"IF(A172=\"\",\"\",SUMIF('Item List'!A:D,Report!A172,'Item List'!D:D))","v":""},{"$f":"IF(A172=\"\",\"\",SUMIFS(Transaction!F:F,Transaction!E:E,\"In\",Transaction!B:B,Report!A172))","v":""},{"$f":"IF(A172=\"\",\"\",SUMIFS(Transaction!F:F,Transaction!E:E,\"out\",Transaction!B:B,Report!A172))","v":""},""]